program: Gaussian 09
title: 000076176
version: EM64L-G09RevD.01
frameworkgroup: C1[X(C13H4Cl8N2O)]
method: RPBEPBE
basis: SDD
operation: Freq
keyword: #p
keyword: freq=noraman
keyword: PBEPBE/SDD
title: #p freq=noraman PBEPBE/SDD
converged: YES YES NO NO
title: Mulliken charges:
elementType: Cl Cl Cl Cl Cl Cl Cl Cl O N N C C C C C C C C C C C C C H H H H
charge: 0.099461 0.098733 0.019058 0.018955 0.019479 0.019627 -0.010516 -0.010479 -0.203783 -0.507337 -0.505851 0.728086 0.727349 0.356351 -0.203427 -0.202638 -0.237264 -0.237933 -0.237270 -0.237409 -0.230252 -0.229941 -0.093738 -0.093848 0.287976 0.287994 0.289304 0.289313
chargesum: 0.00000
title: Mulliken charges with hydrogens summed into heavy atoms:
elementType: Cl Cl Cl Cl Cl Cl Cl Cl O N N C C C C C C C C C C C C C
charge: 0.099461 0.098733 0.019058 0.018955 0.019479 0.019627 -0.010516 -0.010479 -0.203783 -0.507337 -0.505851 0.728086 0.727349 0.356351 -0.203427 -0.202638 -0.237264 -0.237933 0.050706 0.050586 0.059052 0.059372 -0.093738 -0.093848
polarizability: 3.40594819e+02 -1.75847514e+01 2.29924365e+02 2.34365517e-01 -8.84994555e-02 1.98353811e+02
1716.lowfreq: -3.4254 -1.6768 -0.0024 -0.0019 -0.0016 4.9112 12.2294 16.9238 22.1528
frequency: 12.0748 16.8996 22.1494 37.5250 39.0609 56.8561 78.1902 82.3599 100.1713 119.8517 133.8283 137.9171 149.6625 172.7787 175.8148 176.0666 180.3712 192.5856 192.6886 196.4652 226.0102 275.8072 310.0163 327.8808 350.3689 350.5448 379.4397 379.7175 410.1341 410.2432 411.8009 432.5244 480.9436 520.3146 520.5113 541.5046 548.7205 552.3092 559.0984 652.9500 660.6300 708.5578 708.7648 757.8508 760.6542 763.4358 799.2823 843.0551 855.8172 856.1058 863.2447 863.4946 886.7856 996.6062 1054.4525 1076.7579 1112.9250 1117.8270 1180.2335 1180.8393 1209.7994 1282.8766 1342.5338 1342.8563 1371.0768 1372.3805 1374.1487 1430.8121 1431.3062 1522.8649 1545.0329 1546.4987 1570.8114 1571.8167 3189.4376 3189.5526 3191.0774 3191.1564
redmass: 19.8834 20.7724 20.9709 25.3223 28.5732 23.7220 26.6388 24.8946 18.1919 20.0118 27.9922 17.9718 15.0508 10.5845 24.0633 23.8871 24.1425 4.8366 4.8385 23.4819 22.7558 16.8929 14.5102 18.0643 32.7571 32.5053 10.2943 10.7341 8.2853 8.0710 11.6909 16.8269 9.4930 5.0504 5.0478 7.1637 7.1068 5.0305 4.4490 6.3533 11.2679 6.3509 9.5846 11.9505 11.4612 11.3187 11.0407 8.2105 1.4367 1.4360 1.3729 1.3719 9.0599 10.3964 2.8246 1.9972 3.9139 6.1458 1.5336 1.5291 3.6741 3.8950 5.4266 5.6010 5.2349 4.5596 5.3576 3.9965 4.3756 13.0762 9.6067 9.5748 8.1991 8.2290 1.0934 1.0933 1.0942 1.0942
irintensity: 0.2306 0.0128 0.1469 0.0376 0.0404 0.9312 0.3423 0.0135 1.2561 0.3222 3.7953 0.0316 0.7676 2.3494 0.0658 0.8188 0.0800 0.0313 0.0408 2.7092 0.5029 9.3209 0.6490 8.3065 1.2444 0.3594 7.5940 18.1576 18.6729 3.3550 66.9688 34.4635 20.5462 0.2208 0.2543 8.5322 2.5786 3.3656 15.4692 11.1467 23.9807 21.8588 4.3952 0.3837 14.8906 122.1861 64.3738 132.1587 39.9152 42.4290 1.0403 0.7867 76.1128 15.6433 19.0875 3.4914 50.9653 4.7970 0.9920 18.0291 117.1971 21.6468 0.7071 20.2702 222.7220 7.0840 174.6864 10.2090 266.6935 66.2699 20.0138 154.8881 306.8055 83.9335 3.2944 3.3262 1.1830 1.0175
temp: 298.150 k
press: 1.00000 atm
elementType: 17 17 17 17 17 17 17 17 8 7 7 6 6 6 6 6 6 6 6 6 6 6 6 6 1 1 1 1
symmnumber: 1
zpe: 368674.2 jmol-1
zpe.correction: 0.140421 hartree
zpe.thermalcorrener: 0.164804 hartree
zpe.thermalcorrenthalpy: 0.165748 hartree
zpe.thermalcorrgfe: 0.080936 hartree
zpe.sumelectzpe: -4361.198476 hartree
zpe.sumelectthermal: -4361.174093 hartree
zpe.sumelectthermalent: -4361.173149 hartree
zpe.sumelectthermalfe: -4361.257961 hartree
dipole: 0.0021 -0.0131 0.0030
dipole: 0.0136
quadrupole: -174.3658 -185.1852 -194.1688
quadrupole: -0.2521 0.0079 -0.1162
quadrupole: 10.2074 -0.6119 -9.5955 -0.2521 0.0079 -0.1162
hfenergy: -4361.3388967 hartree
pointgroup: C01 [X(C13H4Cl8N2O1)]
dipole: -0.0007507 0.0051834 0.0011527 debye
polarizability: 339.9297282|-19.5544872|230.5894654|-0.2650895|0.034848|198.3538006 unknown
InChI: InChI=1S/C13H4Cl8N2O/c14-5-1-7(16)11(8(17)2-5)22(20)13(24)23(21)12-9(18)3-6(15)4-10(12)19/h1-4H
charge 0 multiplicity 1
28 atoms
Cl -1.308372 -0.973636 2.69444
Cl 1.307908 0.887785 2.719495
Cl -2.071735 -2.736744 -0.385938
Cl 2.050971 2.735877 -0.317551
Cl -2.586212 2.569793 1.23367
Cl 2.610128 -2.604964 1.169809
Cl -6.524984 0.197463 -1.8411
Cl 6.522967 -0.127438 -1.854241
O  0.000278 0.004878 -0.941453
N  -1.203974 -0.129769 1.029002
N  1.204803 0.087551 1.031654
C  -2.447619 -0.071982 0.348761
C  2.448041 0.056107 0.348894
C  0.000331 -0.011763 0.327285
C  -2.989728 -1.186525 -0.350881
C  2.980304 1.191939 -0.323661
C  -3.217201 1.123569 0.360456
C  3.227393 -1.132988 0.330644
C  -4.222347 -1.12362 -1.023246
C  4.211876 1.155391 -0.999781
C  -4.45451 1.227525 -0.301511
C  4.464364 -1.21055 -0.335575
C  -4.933363 0.0921 -0.982636
C  4.932607 -0.055279 -0.990136
H  -4.611742 -1.990307 -1.561452
H  4.593383 2.038184 -1.517047
H  -5.021706 2.160446 -0.285033
H  5.03924 -2.138844 -0.34247
