program: Gaussian 09
title: 000076143
version: EM64L-G09RevD.01
frameworkgroup: C1[X(C10H10O3)]
method: RPBEPBE
basis: SDD
operation: Freq
keyword: #pfreq=noraman
keyword: PBEPBE/SDD
title: #p freq=noraman PBEPBE/SDD
converged: YES YES NO NO
title: Mulliken charges:
elementType: O O O C C C C C C C C C C H H H H H H H H H H
charge: -0.266161 -0.250753 -0.229723 0.256777 0.211286 -0.318359 -0.315395 0.347222 -0.499481 -0.356853 -0.367677 0.108853 -0.788592 0.233794 0.231545 0.235798 0.232207 0.262733 0.254801 0.281510 0.238385 0.237253 0.260831
chargesum: 0.00000
title: Mulliken charges with hydrogens summed into heavy atoms:
elementType: O O O C C C C C C C C C C
charge: -0.266161 -0.250753 -0.229723 0.256777 0.211286 0.146980 0.152609 0.347222 -0.236748 -0.102052 -0.086167 0.108853 -0.052123
polarizability: 1.85513647e+02 -2.98165038e+00 1.15870052e+02 4.58475796e-01 -1.11961241e+00 6.09485608e+01
1716.lowfreq: -7.7381 -0.0011 -0.0010 -0.0009 2.1412 8.6581 59.3015 77.6332 130.6418
frequency: 59.2843 77.6246 130.6379 141.5539 159.4693 187.5481 301.2007 319.3175 328.4610 351.0633 443.4290 449.5978 463.6369 499.5642 520.8745 567.2615 615.6231 638.8850 685.2325 722.6498 731.0105 841.2143 845.1098 869.0834 889.7888 913.1503 946.9300 980.4305 1017.4440 1025.2844 1031.2708 1065.3996 1087.3400 1106.1095 1158.0553 1202.7641 1220.7257 1249.5209 1261.1829 1291.0691 1350.8808 1354.6965 1368.8827 1389.6743 1421.4432 1447.5124 1456.4532 1459.9511 1463.1119 1488.7439 1562.0791 1599.3738 1617.5441 2984.4285 3001.3210 3011.6896 3068.1748 3103.0986 3106.5342 3125.5646 3155.1527 3164.0303 3174.4251
redmass: 4.5957 4.0633 4.5088 1.0295 4.4701 3.8126 3.2755 3.9618 4.6058 5.3611 3.9264 3.1346 5.7442 4.3242 3.6459 5.5128 3.1064 3.2270 3.7637 5.6265 3.6831 1.7577 2.8231 3.1547 1.4807 3.0608 2.0475 1.3264 3.1126 1.8282 3.5536 2.0055 1.9620 2.2942 1.7163 1.1396 2.1272 1.2595 1.5749 3.4343 1.3819 1.3437 1.2896 4.6420 4.6122 1.0995 1.1107 1.1334 1.0494 3.0515 7.4469 8.2338 7.1485 1.0376 1.0672 1.0612 1.0969 1.0992 1.1046 1.0991 1.0879 1.0912 1.0971
irintensity: 3.5835 3.5280 11.0206 0.7631 2.4249 0.3724 4.2685 3.4731 6.2301 7.0081 5.1695 2.8512 2.2446 0.9476 0.7955 20.9020 6.4749 7.9641 4.5850 6.9258 2.4191 33.9002 22.8025 47.6426 30.9270 7.4423 36.7754 0.6573 8.7164 1.2555 62.9972 9.2581 0.3204 56.6092 7.1507 10.7965 43.6282 5.2014 153.8744 472.3289 4.8245 3.8945 67.6639 17.5678 5.4710 37.4653 1.0123 15.4545 20.4142 63.3537 242.5261 48.8625 32.5562 3.9129 53.2640 47.2655 13.2798 30.7810 17.5537 17.1290 0.6256 2.6132 5.1368
temp: 298.150 k
press: 1.00000 atm
elementType: 8 8 8 6 6 6 6 6 6 6 6 6 6 1 1 1 1 1 1 1 1 1 1
symmnumber: 1
zpe: 468161.9 jmol-1
zpe.correction: 0.178313 hartree
zpe.thermalcorrener: 0.189594 hartree
zpe.thermalcorrenthalpy: 0.190538 hartree
zpe.thermalcorrgfe: 0.140909 hartree
zpe.sumelectzpe: -611.769002 hartree
zpe.sumelectthermal: -611.757721 hartree
zpe.sumelectthermalent: -611.756777 hartree
zpe.sumelectthermalfe: -611.806406 hartree
dipole: 5.0931 -2.4591 0.0706
dipole: 5.6561
quadrupole: -73.4882 -74.9375 -76.1142
quadrupole: 4.5647 -0.1780 0.6893
quadrupole: 1.3584 -0.0908 -1.2676 4.5647 -0.1780 0.6893
hfenergy: -611.9473152 hartree
pointgroup: C01 [X(C10H10O3)]
dipole: -2.0107525 -0.9528593 -0.0292357 debye
dipolederiv: -1.1869162 -0.3880225 0.0520963 -0.5519862 -0.5930771 0.062458 -0.0187282 -0.0100823 -0.2875698 -1.7047247 -0.003793 -0.0972885 0.0443633 -0.3530857 0.0279261 0.0289857 0.0041874 -0.2804842 -1.1767585 -0.0725901 -0.0053546 -0.3592775 -0.6227489 -0.0172364 -0.0189346 -0.0129333 -0.3208644 0.3918503 0.4996128 -0.0149729 1.1892242 0.3903429 -0.050907 0.087363 -0.0165811 0.0368152 1.3755904 -0.0817022 0.067107 -0.6244049 0.025201 -0.0379773 -0.0416759 -0.0552286 0.0472865 0.7417628 0.1539435 -0.1178945 -0.1842624 0.1106481 0.0276942 -0.1489875 0.0214149 0.3292543 0.6515502 0.0918792 0.0842977 0.5401698 0.2512093 0.0881166 0.1082119 0.0842958 0.3218771 -0.961542 0.2191321 -0.0000928 0.2778521 -0.1422332 -0.0036836 0.0158287 -0.0063862 -0.0222095 0.1561432 -0.2140639 0.0116142 0.0877067 -0.0138707 0.0136425 0.0319893 0.029628 -0.1519059 -0.336652 -0.0227666 -0.0208807 -0.1754358 0.0985425 0.0067001 -0.0596825 0.0209398 -0.1615155 0.0963217 0.0181096 0.0078256 -0.1748974 0.0167325 0.0073918 -0.0045476 0.0108911 -0.1295088 1.9255875 -0.2171546 -0.0048036 -0.2256931 0.9523513 0.0427444 -0.0069248 0.0337704 0.1159303 -0.0985832 0.1134737 0.0051793 0.2757619 -0.4717908 -0.0253498 0.012249 -0.0235081 0.0539709 -0.0174904 -0.0114313 -0.0146845 0.0993442 0.0868025 -0.0514728 0.0894469 0.0207377 -0.1459867 -0.0345517 -0.0860419 -0.0058853 -0.1431118 -0.0242702 -0.0277322 -0.0276061 -0.045403 0.0935172 0.0407225 -0.0130653 0.0386983 -0.1429803 0.0324492 -0.0358768 -0.0952717 -0.0241546 -0.1399709 -0.138985 0.0266904 0.0197256 0.0651418 0.0704775 -0.0207249 0.0511953 -0.023826 0.0930693 0.1203652 0.0329032 -0.0021987 0.041391 -0.0310769 -0.0041883 -0.0036242 -0.0008281 0.1523991 0.0655453 0.0626522 0.0023302 0.0515713 -0.0350388 -0.0044882 -0.0021483 -0.0023659 0.16719 0.0764048 -0.0905172 -0.0044467 -0.0364257 0.0506792 -0.0040996 0.0050619 -0.0106195 0.1590395 0.0673157 -0.030963 -0.098683 -0.0171387 0.0601079 -0.0477429 -0.0688986 -0.0731644 -0.030133 0.0689842 -0.0399577 0.0949268 -0.0223752 0.0469073 0.0560568 0.0664558 0.0808036 -0.0199957 -0.1219399 0.0536723 0.0033851 -0.0145373 0.0947414 -0.0012507 0.0002424 -0.0015876 0.1197951 unknown
polarizability: 185.5515098|2.4713276|115.8348134|0.6813792|0.999929|60.9459368 unknown
InChI: InChI=1S/C10H10O3/c1-7(11)8-2-3-9-10(6-8)13-5-4-12-9/h2-3,6H,4-5H2,1H3
charge 0 multiplicity 1
23 atoms
O  -1.774582 -1.632265 -0.033811
O  -2.591564 1.178235 -0.00409
O  3.839124 0.74756 0.034903
C  -0.835268 -0.573652 -0.015343
C  -1.237373 0.792516 0.01467
C  -3.134895 -1.203419 0.358451
C  -3.51335 0.081278 -0.383277
C  1.515571 0.11637 0.005327
C  0.530293 -0.903983 -0.028484
C  -0.261056 1.812456 0.066097
C  1.10193 1.478576 0.063175
C  2.983893 -0.187614 -0.010173
C  3.435688 -1.643881 -0.081776
H  -3.165802 -1.042606 1.453454
H  -3.79798 -2.039012 0.084043
H  -3.457705 -0.071751 -1.47781
H  -4.518602 0.433695 -0.103457
H  0.799985 -1.963973 -0.055396
H  -0.598374 2.853015 0.095385
H  1.876401 2.25074 0.096376
H  3.052856 -2.135281 -0.995736
H  3.06061 -2.219871 0.784915
H  4.535397 -1.677734 -0.087643
