program: Gaussian 09
title: 000076121
version: EM64L-G09RevD.01
frameworkgroup: C1[X(C4H7NO)]
method: RPBEPBE
basis: SDD
operation: Freq
keyword: #pfreq=noraman
keyword: PBEPBE/SDD
title: #p freq=noraman PBEPBE/SDD
converged: NO YES NO YES
title: Mulliken charges:
elementType: O N C C C C H H H H H H H
charge: -0.243015 -0.099135 -0.642612 -0.005557 -0.041186 -0.573979 0.241971 0.241961 0.276355 0.226111 0.169138 0.220712 0.229236
chargesum: 0.00000
title: Mulliken charges with hydrogens summed into heavy atoms:
elementType: O N C C C C
charge: -0.243015 -0.099135 0.117676 0.220554 0.127952 -0.124032
polarizability: 9.03573795e+01 -3.63769699e+00 4.96950962e+01 -8.73874735e-03 3.81330751e-03 2.79058254e+01
1716.lowfreq: -17.4077 -0.0010 -0.0009 -0.0005 7.7530 15.9863 132.9511 207.8342 258.5623
frequency: 132.9479 207.8297 258.5583 266.4563 322.1193 351.4439 505.4221 636.5071 686.6271 838.5303 871.1006 957.7869 974.2240 1008.9296 1079.6918 1126.2438 1266.7074 1291.3539 1336.8447 1396.1473 1415.5468 1440.1579 1484.1319 1487.8419 1623.1700 1663.2479 2950.0366 2987.7213 3072.5388 3119.9678 3121.3228 3134.0945 3235.0412
redmass: 3.4169 1.0878 3.6118 1.8500 3.0707 2.3028 4.0980 3.0016 1.5864 3.8259 1.3437 1.4200 1.2616 1.5737 1.8320 1.3160 2.5409 1.9903 1.8231 1.3159 1.1917 1.2240 1.0441 1.0876 6.0141 5.0759 1.0866 1.0345 1.1021 1.0985 1.0685 1.0865 1.1149
irintensity: 4.1138 0.1553 8.9031 0.0667 6.7147 26.3546 1.4600 13.9917 4.3162 6.9576 109.2061 1.7064 25.0285 6.3832 140.0598 0.0111 55.4587 32.0701 20.5011 20.8709 22.9493 25.8240 20.7621 14.8424 617.9531 4.5499 81.1682 21.9980 27.1179 0.1576 11.1508 2.3835 15.5248
temp: 298.150 k
press: 1.00000 atm
elementType: 8 7 6 6 6 6 1 1 1 1 1 1 1
symmnumber: 1
zpe: 276638.2 jmol-1
zpe.correction: 0.105366 hartree
zpe.thermalcorrener: 0.111959 hartree
zpe.thermalcorrenthalpy: 0.112903 hartree
zpe.thermalcorrgfe: 0.075448 hartree
zpe.sumelectzpe: -286.107636 hartree
zpe.sumelectthermal: -286.101043 hartree
zpe.sumelectthermalent: -286.100099 hartree
zpe.sumelectthermalfe: -286.137553 hartree
dipole: -3.1844 -0.0553 0.0003
dipole: 3.1849
quadrupole: -45.8754 -30.2022 -38.5241
quadrupole: -0.2799 0.0009 0.0014
quadrupole: -7.6748 7.9983 -0.3235 -0.2799 0.0009 0.0014
hfenergy: -286.2130017 hartree
pointgroup: C01 [X(C4H7N1O1)]
dipole: 1.2521044 -0.048489 -0.0001235 debye
dipolederiv: -1.4500517 -0.0923247 0.000084 0.3996231 -0.4481447 -0.0000152 0.0002203 0.0000155 -0.3681902 -1.6251328 -0.0664661 0.0002173 -0.1875755 -0.5721515 0.0000914 0.0000799 0.0000209 -0.1850252 -0.0187004 0.0141898 0.0000365 0.0468053 0.3242684 -0.0000552 0.0000687 -0.0000439 0.2447231 1.1664103 -0.1705339 -0.0001914 -0.396973 0.1912525 -0.0000352 -0.0000903 -0.0000496 -0.0649975 2.1438785 0.2283957 -0.0001933 0.2322096 0.6919797 -0.0001299 -0.0003724 -0.0001293 0.1325085 -0.5361398 0.0054029 0.0000064 -0.1759881 0.0504253 -0.0000983 -0.0000017 -0.0001316 -0.5133951 0.0536764 -0.0857357 0.108266 -0.0246365 0.020134 0.0167577 0.0761212 0.0665925 -0.057987 0.0535382 -0.0858227 -0.1083609 -0.0246574 0.0201781 -0.016722 -0.0761947 -0.0665056 -0.0577977 0.010298 0.12548 0.0000737 0.0052673 0.1195193 0.0000071 0.0000524 -0.0000207 0.1346182 0.0606671 -0.0715899 0.0000399 0.0191173 -0.091697 0.0000548 0.0000519 0.000066 0.1794221 0.0566305 0.118948 -0.0000158 0.0295614 -0.2285514 0.0000402 0.0000305 0.0000851 0.1339764 -0.0183027 0.0798574 0.0000178 0.0887126 0.0153169 0.0000297 0.0000092 0.0000332 0.2025356 0.1032284 0.0001992 0.0000198 -0.0114662 -0.0925295 0.0000749 0.0000251 0.0000676 0.2196086 unknown
polarizability: 90.4941645|2.7662499|49.5583112|-0.0088182|-0.0036258|27.9058254 unknown
InChI: InChI=1S/C4H7NO/c1-3-5(2)4-6/h3-4H,1H2,2H3
charge 0 multiplicity 1
13 atoms
O  -2.368718 -0.054437 0.000333
N  -0.013191 0.050238 0.000037
C  0.009211 1.522188 -0.000067
C  1.192749 -0.684633 -0.000016
C  -1.244663 -0.618989 0.000134
C  2.447879 -0.160406 -0.000329
H  0.527894 1.899036 -0.899936
H  0.528693 1.899112 0.8993
H  -1.033802 1.874555 0.000351
H  1.04781 -1.77215 0.000248
H  -1.120114 -1.724683 0.000367
H  3.310463 -0.830856 -0.000314
H  2.649889 0.914425 -0.000608
