program: Gaussian 09
title: 000076133
version: EM64L-G09RevD.01
frameworkgroup: C1[X(C4H2BrClS)]
method: RPBEPBE
basis: SDD
operation: Freq
keyword: #p
keyword: freq=noraman
keyword: PBEPBE/SDD
title: #p freq=noraman PBEPBE/SDD
converged: NO NO NO NO
title: Mulliken charges:
elementType: Br Cl S C C C C H H
charge: 0.089727 0.023175 0.387464 -0.026729 -0.051956 -0.516442 -0.443624 0.266024 0.272360
chargesum: 0.00000
title: Mulliken charges with hydrogens summed into heavy atoms:
elementType: Br Cl S C C C C
charge: 0.089727 0.023175 0.387464 0.239296 0.220404 -0.516442 -0.443624
polarizability: 1.35517750e+02 1.15218634e+00 7.27429560e+01 1.54167623e-03 -4.90533664e-04 2.74286070e+01
1716.lowfreq: -0.0010 0.0019 0.0025 6.1550 10.2109 12.6122 94.1465 153.0720 242.6469
frequency: 94.1389 153.0720 242.6435 265.8250 283.5031 447.6963 449.2606 526.8895 613.5428 665.9678 786.5167 875.6092 899.5224 943.8878 1069.0105 1193.1081 1287.6896 1461.8223 1532.6214 3190.0256 3205.9532
redmass: 26.0938 20.0672 9.1318 30.5964 9.9471 9.0328 7.6194 3.0129 13.1198 7.9473 1.2132 1.4083 4.9602 7.5391 1.6625 1.2981 2.8326 10.0367 6.0108 1.0918 1.1006
irintensity: 0.1971 0.0253 0.1250 0.9119 0.0391 13.7337 28.1511 0.0944 1.5092 8.5332 69.0078 0.0262 20.4613 136.4218 2.2452 11.3771 0.4490 32.7344 38.0245 1.1901 0.0335
temp: 298.150 k
press: 1.00000 atm
elementType: 35 17 16 6 6 6 6 1 1
symmnumber: 1
zpe: 120752.9 jmol-1
zpe.correction: 0.045992 hartree
zpe.thermalcorrener: 0.052935 hartree
zpe.thermalcorrenthalpy: 0.053879 hartree
zpe.thermalcorrgfe: 0.012657 hartree
zpe.sumelectzpe: -1024.662159 hartree
zpe.sumelectthermal: -1024.655216 hartree
zpe.sumelectthermalent: -1024.654272 hartree
zpe.sumelectthermalfe: -1024.695494 hartree
dipole: -0.1779 1.4413 0.0000
dipole: 1.4522
quadrupole: -63.2680 -58.3722 -66.6430
quadrupole: 1.4191 0.0002 -0.0002
quadrupole: -0.5069 4.3889 -3.8820 1.4191 0.0002 -0.0002
hfenergy: -1024.7081513 hartree
pointgroup: C01 [X(C4H2Br1Cl1S1)]
dipole: 0.0854432 -0.5649275 -0.0000115 debye
dipolederiv: -0.623278 -0.0887026 0.000027 -0.095932 -0.0377342 0.000003 0.0000509 0.0000131 0.0655107 -0.815585 0.1047878 -0.0000016 0.1306469 -0.1059495 -0.0000032 0.0000172 -0.0000073 0.0258464 -0.2534892 0.004387 0.0000087 -0.0435389 -0.197499 -0.0000128 0.0000108 -0.0000229 0.2423236 -0.2305751 -0.1909531 0.0000016 -0.0175202 -0.2210141 0.0000101 0.0000147 0.000003 -0.0940498 -0.2235511 0.1540884 0.0000171 0.0223275 -0.2616527 -0.0000072 -0.0000061 -0.0000092 -0.0989148 0.9951403 0.0061862 -0.0000735 0.0623589 0.3380775 0.0000024 -0.000104 -0.0000152 -0.3061144 1.0364898 0.0093224 0.0000197 -0.0662716 0.4313552 0.000023 -0.0000016 0.0000449 -0.2474381 0.0613865 0.0541859 0.000005 0.0784355 0.0237284 -0.0000108 0.0000169 -0.0000061 0.202924 0.0534618 -0.0533021 -0.0000039 -0.0705061 0.0306882 -0.0000046 0.0000013 -0.0000003 0.2099123 unknown
polarizability: 135.407974|2.8647271|72.8527322|-0.0015545|0.0004482|27.428607 unknown
InChI: InChI=1S/C4H2BrClS/c5-3-1-2-4(6)7-3/h1-2H
charge 0 multiplicity 1
9 atoms
Br 3.114074 0.512695 -0.0001
Cl -3.008974 0.510187 -0.000033
S  -0.00958 1.348469 0.00005
C  0.698777 -1.220536 -0.000022
C  -0.748075 -1.21422 -0.000031
C  1.24766 0.048553 -0.000003
C  -1.279067 0.060035 -0.000036
H  1.298614 -2.132278 -0.000071
H  -1.358129 -2.119405 -0.000054
