program: Gaussian 09
title: 000076113
version: EM64L-G09RevD.01
frameworkgroup: C1[X(C3H9BrSi)]
method: RPBEPBE
basis: SDD
operation: Freq
keyword: #p
keyword: freq=noraman
keyword: PBEPBE/SDD
title: #p freq=noraman PBEPBE/SDD
converged: YES YES NO NO
title: Mulliken charges:
elementType: Br Si C C C H H H H H H H H H
charge: -0.255971 0.908666 -0.982539 -0.982554 -0.982618 0.262237 0.240394 0.262352 0.262226 0.262397 0.240368 0.240388 0.262386 0.262268
chargesum: 0.00000
title: Mulliken charges with hydrogens summed into heavy atoms:
elementType: Br Si C C C
charge: -0.255971 0.908666 -0.217556 -0.217563 -0.217576
polarizability: 9.01751180e+01 -4.66760412e-03 6.33292309e+01 -7.22288012e-04 1.07488979e-03 6.33173115e+01
1716.lowfreq: -16.1757 -4.3690 -0.0014 -0.0009 0.0016 9.8474 108.6591 131.8670 137.5508
frequency: 108.6561 131.7858 137.5327 148.2979 148.6131 185.4897 209.6678 212.7264 323.7299 599.3581 710.8766 710.9224 761.5946 812.0112 813.5996 920.8296 923.6622 924.3484 1304.2405 1305.3675 1318.7889 1427.7311 1440.6440 1440.9409 1443.8025 1444.1726 1458.9769 2984.9216 2985.0404 2986.7381 3086.8618 3087.0008 3089.0447 3105.0263 3106.1870 3106.3030
redmass: 1.0123 1.0255 1.0223 3.0065 3.0009 3.0825 2.6856 2.6726 6.5798 4.1619 2.9793 2.9214 1.1684 1.3630 1.3573 1.4534 1.5072 1.5029 1.1973 1.1968 1.1828 1.0534 1.0481 1.0476 1.0516 1.0518 1.0461 1.0353 1.0353 1.0351 1.0970 1.0970 1.0968 1.0992 1.0987 1.0987
irintensity: 0.0135 0.0134 0.0180 0.7545 0.7490 0.0066 3.5416 3.5711 43.3469 15.3968 8.8545 8.5096 0.0028 11.9177 11.5362 196.0843 98.1628 98.6679 45.7606 45.4426 5.3689 0.0013 6.1470 6.7801 7.5440 7.2654 17.3165 6.9454 6.9234 10.5055 2.2810 2.2467 24.9853 0.1013 12.0484 11.9268
temp: 298.150 k
press: 1.00000 atm
elementType: 35 14 6 6 6 1 1 1 1 1 1 1 1 1
symmnumber: 1
zpe: 292519.8 jmol-1
zpe.correction: 0.111415 hartree
zpe.thermalcorrener: 0.120496 hartree
zpe.thermalcorrenthalpy: 0.121440 hartree
zpe.thermalcorrgfe: 0.076902 hartree
zpe.sumelectzpe: -422.200604 hartree
zpe.sumelectthermal: -422.191524 hartree
zpe.sumelectthermalent: -422.190579 hartree
zpe.sumelectthermalfe: -422.235118 hartree
dipole: -3.5988 0.0011 -0.0001
dipole: 3.5988
quadrupole: -49.6435 -48.7268 -48.7284
quadrupole: -0.0026 0.0000 0.0007
quadrupole: -0.6106 0.3061 0.3045 -0.0026 0.0000 0.0007
hfenergy: -422.3120191 hartree
pointgroup: C01 [X(C3H9Br1Si1)]
dipole: -1.4158872 0.0008806 0.0011249 debye
dipolederiv: -0.8897345 0.0001888 0.0004756 0.0002596 -0.3716943 -0.000004 0.0004971 0.0000281 -0.3715578 1.8416634 -0.0005634 -0.0005396 -0.0002756 1.2340073 -0.0001541 -0.0006259 -0.0000997 1.2338861 -0.3801541 -0.0407884 -0.059754 -0.0098135 -0.3861757 -0.0444269 -0.0145956 -0.0442013 -0.4206447 -0.3800124 -0.03158 0.0650863 -0.0075297 -0.3738368 0.0374437 0.0158623 0.0371574 -0.4334406 -0.3803097 0.0724465 -0.0056027 0.0174592 -0.4507729 0.0071671 -0.0011348 0.0071536 -0.356399 0.0961428 0.047699 -0.0006756 0.0617967 -0.1010958 -0.0015111 0.0056714 -0.022824 0.1183989 -0.1294892 -0.0181547 -0.0269257 -0.0529076 0.1057149 -0.0184331 -0.0775682 -0.0184132 0.0913353 0.0962506 -0.0179724 0.044507 -0.0170917 0.0983367 0.0540863 0.059959 0.0755346 -0.0804498 0.0962526 0.0472528 -0.0063495 0.0600847 -0.0927224 0.0335135 -0.0148112 0.0548067 0.10997 0.096087 -0.0246405 -0.0416851 -0.0260783 0.0750686 -0.077581 -0.0570645 -0.0990167 -0.0569404 -0.1295414 -0.0135886 0.0297233 -0.0402425 0.1108977 0.0155057 0.0848336 0.015317 0.0859382 -0.1294927 0.0324352 -0.0019622 0.0935573 0.0789339 0.0028434 -0.006492 0.0028895 0.1180124 0.0959811 -0.0295715 -0.0378621 -0.0435207 0.0204389 -0.1204406 -0.0450122 -0.0989659 -0.0025941 0.0963563 -0.023163 0.0415644 -0.0356978 0.0528998 0.1119911 0.0504809 0.090634 -0.0355145 unknown
polarizability: 90.1750923|-0.0133953|63.3292735|-0.023102|0.0008582|63.3172947 unknown
InChI: InChI=1S/C3H9BrSi/c1-5(2,3)4/h1-3H3
charge 0 multiplicity 1
14 atoms
Br 2.223282 -0.000291 -0.001807
Si -0.170818 0.000735 0.000137
C  -0.687631 -1.031773 -1.51055
C  -0.68515 -0.79291 1.64958
C  -0.686482 1.825431 -0.137328
H  -0.297083 -2.061308 -1.432558
H  -1.790641 -1.083128 -1.587567
H  -0.294995 -0.587958 -2.441926
H  -0.295529 -1.822879 1.72652
H  -0.290498 -0.214598 2.50304
H  -1.788107 -0.830837 1.735188
H  -1.789505 1.918163 -0.141712
H  -0.292868 2.409249 0.712844
H  -0.296875 2.273404 -1.067961
