program: Gaussian 09
title: 000076089
version: EM64L-G09RevD.01
frameworkgroup: C1[X(C5H2Cl2F2N2)]
method: RPBEPBE
basis: SDD
operation: Freq
keyword: #p
keyword: freq=noraman
keyword: PBEPBE/SDD
title: #p freq=noraman PBEPBE/SDD
converged: NO NO NO NO
title: Mulliken charges:
elementType: Cl Cl F F N N C C C C C H H
charge: 0.002242 0.002238 -0.153125 -0.153124 0.023264 -0.646185 0.726324 -0.412923 -0.412923 0.176039 0.176032 0.336070 0.336071
chargesum: 0.00000
title: Mulliken charges with hydrogens summed into heavy atoms:
elementType: Cl Cl F F N N C C C C C
charge: 0.002242 0.002238 -0.153125 -0.153124 0.023264 0.025956 0.726324 -0.412923 -0.412923 0.176039 0.176032
polarizability: 1.24285855e+02 1.57085950e-04 1.03541549e+02 6.01995970e-04 -3.26950899e-04 3.34254417e+01
1716.lowfreq: 0.0018 0.0025 0.0030 2.1778 5.0493 11.0813 84.4115 100.6454 185.3900
frequency: 84.4005 100.6415 185.3900 192.7566 224.4603 290.4118 297.2823 307.7408 347.8779 375.0758 386.7294 514.7725 539.2389 552.5183 575.1512 623.3010 626.2415 632.8263 683.9601 724.5369 999.2754 1000.8126 1087.4624 1094.1911 1335.7811 1363.6867 1414.2734 1484.6890 1550.0931 1576.3197 1634.8951 3528.0683 3671.9883
redmass: 21.4079 9.2708 22.7757 8.4870 16.4656 21.9434 10.4747 4.9075 7.3086 15.9289 9.8731 1.0749 1.2232 13.4229 10.1062 11.6427 11.7070 5.7746 9.2003 12.1870 12.1401 9.6921 9.0493 1.6850 12.2697 6.9798 12.0334 6.4403 9.4136 3.1940 1.6245 1.0452 1.1047
irintensity: 0.0000 1.4092 0.8468 0.8129 0.6223 0.1624 3.4751 3.9907 0.0000 3.4218 0.6349 0.0004 290.4513 0.0764 3.1990 1.4256 0.0000 2.1351 74.7786 20.3055 155.1703 5.4458 0.0019 98.5266 64.2885 226.9127 105.3079 0.0228 56.1459 86.8772 403.0063 94.9534 59.1749
temp: 298.150 k
press: 1.00000 atm
elementType: 17 17 9 9 7 7 6 6 6 6 6 1 1
symmnumber: 1
zpe: 179480.8 jmol-1
zpe.correction: 0.068361 hartree
zpe.thermalcorrener: 0.078255 hartree
zpe.thermalcorrenthalpy: 0.079200 hartree
zpe.thermalcorrgfe: 0.032313 hartree
zpe.sumelectzpe: -1420.241086 hartree
zpe.sumelectthermal: -1420.231191 hartree
zpe.sumelectthermalent: -1420.230247 hartree
zpe.sumelectthermalfe: -1420.277134 hartree
dipole: 0.0001 5.7218 0.0003
dipole: 5.7218
quadrupole: -81.5873 -73.4260 -75.4057
quadrupole: 0.0002 -0.0004 -0.0001
quadrupole: -4.7810 3.3803 1.4006 0.0002 -0.0004 -0.0001
hfenergy: -1420.3094467 hartree
pointgroup: C01 [X(C5H2Cl2F2N2)]
dipole: 0.0000109 2.2511276 -0.0000995 debye
dipolederiv: -0.5798431 0.2247439 -0.0000063 0.3217497 -0.2315289 0.0000073 -0.0000225 0.0000049 0.0033291 -0.5798636 -0.2247361 -0.0000161 -0.3217433 -0.2315175 -0.0000142 -0.0000485 -0.0000171 0.003325 -0.8180659 -0.4413624 -0.0000007 -0.4087921 -0.4884573 0.0000012 -0.0000166 -0.0000219 -0.1557231 -0.8180471 0.4413719 -0.000026 0.4087965 -0.4884756 0.0000204 -0.0001667 0.000123 -0.1557216 -1.0767829 -0.0000034 -0.0000658 0.0000054 -0.6905877 -0.00002 0.000007 0.0000476 -0.1780619 -0.1924627 -0.0000119 -0.0000328 -0.0000066 -1.3516098 -0.0000182 -0.0000121 -0.000068 -0.6379111 -0.0673031 0.000009 -0.0000285 0.0000099 1.3604454 0.000029 -0.0000377 0.0000191 0.1843657 0.6725968 -0.6154379 0.000016 -0.5385807 -0.264673 -0.0000031 0.000019 -0.0000155 -0.1307772 0.672632 0.6154245 0.000042 0.5385616 -0.264714 0.0000317 0.0000363 0.000056 -0.1307785 1.198037 0.4651039 0.0000166 0.281041 1.0303859 -0.0000112 0.0000289 0.0000515 0.2221914 1.198028 -0.4651056 0.000079 -0.2810445 1.0304232 -0.0000194 0.0001887 -0.0002108 0.2221939 0.1955349 0.0311561 0.0000162 0.0083462 0.295153 -0.0000056 0.0000169 0.0000055 0.376785 0.1955398 -0.0311521 0.0000065 -0.0083431 0.2951563 0.0000022 0.0000072 0.0000257 0.3767833 unknown
polarizability: 124.2858545|-0.0005383|103.541549|0.000602|0.0003269|33.4254417 unknown
InChI: InChI=1S/C5H2Cl2F2N2/c6-1-3(10)2(7)5(9)11-4(1)8/h10H2
charge 0 multiplicity 1
13 atoms
Cl -2.801593 1.283904 -0.000023
Cl 2.801585 1.283822 0.000032
F  -2.318273 -1.729271 -0.000012
F  2.318202 -1.729331 0.00014
N  -0.000044 -1.682621 -0.000013
N  0.000007 2.536902 0.00001
C  -0.000004 1.167947 -0.000038
C  -1.218491 0.414249 0.000016
C  1.218456 0.414208 -0.00009
C  -1.144167 -0.987371 0.000015
C  1.144104 -0.987416 -0.000107
H  0.882334 3.045729 -0.000061
H  -0.882316 3.045748 0.000032
