program: Gaussian 09
title: 000076151
version: EM64L-G09RevD.01
frameworkgroup: C1[X(C12H13NO3)]
method: RPBEPBE
basis: SDD
operation: Freq
keyword: #p
keyword: freq=noraman
keyword: PBEPBE/SDD
title: #p freq=noraman PBEPBE/SDD
converged: YES YES NO NO
title: Mulliken charges:
elementType: O O O N C C C C C C C C C C C C H H H H H H H H H H H H H
charge: -0.272152 -0.412895 -0.239489 -0.472135 0.169248 0.181479 0.205454 0.227362 -0.608211 -0.565587 -0.328539 -0.793318 0.310715 -0.350313 0.198668 -0.537567 0.299662 0.241950 0.230423 0.256720 0.229131 0.239377 0.276965 0.213691 0.246628 0.240267 0.217491 0.220228 0.374748
chargesum: 0.00000
title: Mulliken charges with hydrogens summed into heavy atoms:
elementType: O O O N C C C C C C C C C C C C
charge: -0.272152 -0.038147 -0.239489 -0.172473 0.169248 0.181479 0.205454 0.227362 -0.135838 -0.308867 -0.099408 -0.063284 0.310715 -0.103686 0.198668 0.140419
polarizability: 2.05856310e+02 1.44915890e+01 1.57715450e+02 -7.31153471e+00 8.97439635e+00 8.60371911e+01
1716.lowfreq: -68.0230 -8.4265 -0.0005 -0.0003 0.0003 0.5673 2.1515 15.7784 39.7638
frequency: -68.0023 15.7049 39.7527 61.7749 82.1447 117.8275 144.1852 170.6345 203.1725 215.6262 257.0538 266.7572 341.1524 388.9181 393.6237 400.3618 430.2356 461.2454 498.5993 510.0503 532.4575 548.9402 588.5003 610.7924 638.1319 660.8905 682.6621 735.0786 753.1993 800.7277 809.5406 831.2127 840.0868 851.6342 906.1894 932.3359 965.9460 994.3194 1002.8525 1039.1561 1063.1736 1111.8648 1113.5184 1132.8224 1156.9511 1191.6659 1196.0229 1239.1439 1253.9969 1279.1965 1301.6766 1314.1499 1326.5525 1404.8145 1416.6338 1426.9078 1445.3059 1449.2407 1460.0710 1463.0183 1470.4055 1478.5035 1480.5303 1488.9500 1573.1935 1599.4366 1634.4353 1658.7149 2951.1474 2977.4078 3020.6219 3035.0289 3057.4972 3080.1196 3088.8403 3118.6648 3135.0161 3160.4014 3171.3191 3503.2080 3605.4823
redmass: 1.0220 5.9818 9.5974 3.9386 4.3185 3.9576 3.7177 4.3420 2.1437 3.2196 1.7075 2.6153 5.4046 5.9444 3.6476 3.2054 2.8093 4.2483 3.2228 1.1957 3.5210 4.0647 2.8520 3.0598 2.3596 2.8471 4.4168 4.9614 3.7917 1.5290 4.7410 3.0301 2.5006 3.5255 3.1321 1.3313 2.0716 3.2824 2.0023 1.4503 2.3339 1.9002 1.2758 1.6284 1.4051 1.4395 2.6318 1.3392 2.2997 1.6077 1.8038 2.9634 2.7902 1.6878 2.5585 1.4559 1.9264 1.1154 1.0475 1.0503 1.9391 2.5619 1.7503 1.2523 7.6261 6.2742 7.1041 8.2945 1.0332 1.0373 1.0590 1.1034 1.0975 1.0992 1.1035 1.0989 1.0895 1.0910 1.0953 1.0638 1.0804
irintensity: 0.0706 0.7905 2.3747 2.4592 6.1102 1.4637 2.0490 2.3829 2.1412 1.2922 1.0402 2.3109 1.0692 1.6727 0.7602 4.0975 2.8172 2.4906 17.6721 86.0117 3.9451 39.4314 26.9076 17.5684 79.4490 56.5096 24.6785 3.0116 1.9993 48.3199 14.9072 12.6349 12.3421 32.2224 4.2014 0.0531 3.9148 7.9058 88.8838 10.0376 162.4026 28.8158 0.7654 12.4877 1.9417 4.5885 157.6057 6.1073 24.9871 3.5576 30.9032 16.5863 39.3825 1.8725 38.5617 35.6999 55.1237 17.6216 21.6731 12.7225 47.6427 58.1897 31.0085 1.1823 0.4792 42.5952 47.5826 234.7376 60.5496 37.5537 22.6260 53.3787 11.3235 20.3177 5.0690 31.7918 12.5135 6.3320 8.6007 16.9507 51.6002
temp: 298.150 k
press: 1.00000 atm
elementType: 8 8 8 7 6 6 6 6 6 6 6 6 6 6 6 6 1 1 1 1 1 1 1 1 1 1 1 1 1
symmnumber: 1
zpe: 596692.1 jmol-1
zpe.correction: 0.227268 hartree
zpe.thermalcorrener: 0.241935 hartree
zpe.thermalcorrenthalpy: 0.242879 hartree
zpe.thermalcorrgfe: 0.183899 hartree
zpe.sumelectzpe: -744.344320 hartree
zpe.sumelectthermal: -744.329653 hartree
zpe.sumelectthermalent: -744.328709 hartree
zpe.sumelectthermalfe: -744.387690 hartree
dipole: -0.9044 -0.6413 0.6180
dipole: 1.2693
quadrupole: -100.9100 -72.1343 -94.0568
quadrupole: 10.8166 -3.2020 2.5509
quadrupole: -11.8763 16.8994 -5.0231 10.8166 -3.2020 2.5509
hfenergy: -744.5715885 hartree
pointgroup: C01 [X(C12H13N1O3)]
dipole: -0.2987679 -0.320852 0.2391253 debye
polarizability: 198.5191883|22.7219913|164.4500804|-9.6541392|9.0076783|86.6396823 unknown
InChI: InChI=1S/C12H13NO3/c1-7-9(6-12(14)15)10-5-8(16-2)3-4-11(10)13-7/h3-5,13-14H,6H2,1-2H3
charge 0 multiplicity 1
29 atoms
O  3.522411 1.433901 -0.011221
O  -2.001151 2.624371 -0.433553
O  -3.735434 1.116436 -0.776068
N  -0.508665 -2.430943 -0.190647
C  -1.213593 -0.399487 0.550915
C  0.203045 -0.307633 0.255637
C  0.623931 -1.602833 -0.200003
C  -1.624107 -1.708195 0.257092
C  -2.106929 0.715456 1.051972
C  1.146553 0.753891 0.333206
C  1.962132 -1.86788 -0.565004
C  -2.989742 -2.332131 0.344514
C  2.480502 0.481955 -0.033895
C  2.887705 -0.814707 -0.475655
C  -2.728716 1.464521 -0.119393
C  3.177393 2.78557 0.423783
H  -0.527509 -3.410651 -0.465721
H  -1.532576 1.422926 1.672601
H  -2.935599 0.307762 1.6569
H  0.825856 1.750703 0.648684
H  2.282239 -2.857348 -0.909555
H  -3.401593 -2.260076 1.368811
H  -3.70157 -1.821154 -0.328896
H  -2.966153 -3.401991 0.071194
H  3.93797 -0.95774 -0.746115
H  4.115093 3.358199 0.365293
H  2.801127 2.791388 1.466363
H  2.417913 3.24321 -0.2410
H  -2.395534 3.048578 -1.244137
