program: Gaussian 09
title: 000076081
version: EM64L-G09RevD.01
frameworkgroup: C1[X(C7H9NO)]
method: RPBEPBE
basis: SDD
operation: Freq
keyword: #pfreq=noraman
keyword: PBEPBE/SDD
title: #p freq=noraman PBEPBE/SDD
converged: NO YES NO YES
title: Mulliken charges:
elementType: O N C C C C C C C H H H H H H H H H
charge: -0.442805 -0.711775 0.403005 -0.601907 0.105803 0.531601 -0.349252 -0.423835 -0.786618 0.220748 0.207866 0.214609 0.238036 0.238046 0.207942 0.299549 0.301455 0.347530
chargesum: 0.00000
title: Mulliken charges with hydrogens summed into heavy atoms:
elementType: O N C C C C C C C
charge: -0.095275 -0.110771 0.403005 -0.381158 0.105803 0.531601 -0.141386 -0.209225 -0.102594
polarizability: 1.19671287e+02 -1.49651375e+00 9.64504328e+01 4.52279988e-03 -1.33969669e-03 4.12585342e+01
1716.lowfreq: -7.4552 -0.0005 0.0005 0.0007 15.2196 15.3383 101.3260 138.6262 201.9943
frequency: 101.3253 138.6230 201.9839 267.3499 286.1202 306.3547 310.4795 324.0586 350.9592 434.9422 436.5968 483.5165 559.0068 578.2588 714.0810 722.1341 749.4296 785.8675 863.6264 893.8971 936.4870 990.0241 1044.8679 1045.2607 1086.5920 1159.4079 1188.1224 1234.9924 1289.2397 1333.4544 1391.2877 1399.5517 1440.2937 1455.5260 1482.7482 1511.7264 1607.7132 1633.8390 1645.7144 2980.0150 3059.1765 3086.5510 3103.1350 3111.7424 3135.6253 3574.2510 3585.4131 3715.1148
redmass: 1.0249 4.7464 2.8702 2.8436 1.1881 1.1313 3.5376 1.0458 6.7955 2.6403 4.2710 4.3217 4.6336 2.8111 3.0724 5.8383 5.0739 1.4700 1.5401 1.3564 3.0281 1.5087 1.5256 1.4732 1.9670 1.1616 1.7562 2.1565 1.5490 2.8476 2.3331 1.8537 2.1340 1.0455 1.5228 2.8258 6.7531 1.5135 2.7944 1.0360 1.0969 1.1005 1.0875 1.0911 1.0957 1.0447 1.0659 1.1041
irintensity: 0.0141 1.2618 21.0761 5.1414 262.3041 183.4606 6.6583 2.2834 2.1464 12.1726 1.6794 2.9849 4.3781 8.9696 0.7011 10.7492 24.7734 52.0259 30.2443 0.1372 2.4146 5.0510 10.9254 26.5263 101.9136 60.1419 71.6785 42.5279 8.3044 18.7994 13.8718 25.8604 26.7302 11.4661 10.9916 195.2914 4.7458 30.6967 163.8583 31.9807 19.1432 18.0067 25.7669 25.0259 20.7280 58.7875 21.1294 18.2184
temp: 298.150 k
press: 1.00000 atm
elementType: 8 7 6 6 6 6 6 6 6 1 1 1 1 1 1 1 1 1
symmnumber: 1
zpe: 381228.8 jmol-1
zpe.correction: 0.145202 hartree
zpe.thermalcorrener: 0.154402 hartree
zpe.thermalcorrenthalpy: 0.155346 hartree
zpe.thermalcorrgfe: 0.111912 hartree
zpe.sumelectzpe: -401.452798 hartree
zpe.sumelectthermal: -401.443599 hartree
zpe.sumelectthermalent: -401.442654 hartree
zpe.sumelectthermalfe: -401.486089 hartree
dipole: -2.1707 -0.7115 -0.0027
dipole: 2.2843
quadrupole: -44.0382 -42.6026 -58.8011
quadrupole: -4.5350 0.0111 -0.0024
quadrupole: 4.4424 5.8780 -10.3204 -4.5350 0.0111 -0.0024
hfenergy: -401.5980007 hartree
pointgroup: C01 [X(C7H9N1O1)]
dipole: 0.85227 0.2851859 -0.0010497 debye
dipolederiv: -1.3293386 0.3842426 0.0000503 0.3572084 -0.16539 -0.0000144 0.0000779 -0.0000164 -0.4066235 -1.4506176 0.3294334 -0.0003803 0.3573107 -0.171938 0.0001029 -0.0011622 0.0002889 -0.7782343 0.1310236 -0.0538417 -0.000001 0.3659118 0.2653265 -0.0000343 -0.0000561 -0.0000618 -0.0042148 -0.3132101 0.1920022 -0.0000014 -0.2650199 0.0824475 0.0000169 0.0000392 -0.0000237 -0.2591077 1.0158131 -0.408128 -0.000091 -0.4883276 -0.1428573 0.0000306 -0.0000977 0.0000237 -0.0323594 1.4645624 -0.3799075 0.0001524 -0.4676484 -0.0236297 -0.0000395 0.0000969 -0.0000287 0.1443126 0.0175045 0.2902533 0.0000163 -0.1451032 0.0920737 0.0000057 -0.000009 0.000003 -0.1632219 -0.2548138 -0.1596364 0.0000051 0.4423983 0.0157999 0.0000041 0.0000661 0.0000485 -0.2484482 -0.0871269 -0.1337286 -0.0000017 -0.0996739 0.0562882 0.0000305 0.0000638 0.000093 0.0640909 0.0465357 0.0612343 0.0000018 0.0657951 -0.1220725 -0.0000263 0.0000046 -0.0000149 0.1631086 0.0360123 0.0937736 0.0000111 0.0768163 -0.1196231 -0.0000147 0.000015 -0.000017 0.1651067 -0.0627205 -0.1152612 0.0000078 -0.1026703 -0.0199856 0.0000068 0.0000009 -0.0000103 0.1736138 0.0043673 -0.0432613 0.103282 -0.0196334 0.059779 -0.0352018 0.1268969 0.019959 -0.0403999 0.0042592 -0.0431895 -0.1033156 -0.0195032 0.0598098 0.0352846 -0.1269229 -0.0198811 -0.0402115 0.0371343 0.1394236 0.0000639 0.0252211 -0.1367867 -0.0000893 0.0000149 -0.0001109 0.1020659 0.1944709 -0.0127658 0.000126 -0.0060503 0.1066154 0.0000721 0.0005384 0.0000654 0.3924436 0.1856398 -0.0278786 0.0000741 -0.0372977 0.1188303 -0.0001304 0.0004379 -0.0003129 0.3926836 0.3605043 -0.1127644 0.0000002 -0.0397337 0.0453128 -0.0000036 -0.0000046 -0.0000038 0.3753956 unknown
polarizability: 119.6889201|-1.3526985|96.4328|-0.004531|0.0013117|41.2585342 unknown
InChI: InChI=1S/C7H9NO/c1-5-4-6(8)2-3-7(5)9/h2-4,9H,8H2,1H3
charge 0 multiplicity 1
18 atoms
O  -2.513771 0.868393 0.00016
N  2.989256 -0.457958 -0.00002
C  -0.754704 -0.786318 0.0000
C  0.620029 -1.106894 -0.000087
C  -1.123605 0.585966 0.000069
C  1.632653 -0.104254 -0.000095
C  -0.137729 1.595867 0.000055
C  1.232685 1.25967 -0.000029
C  -1.824405 -1.858772 0.000036
H  0.911307 -2.165511 -0.000128
H  -0.434056 2.653979 0.000103
H  1.988727 2.053849 -0.000014
H  -2.48115 -1.763162 0.884386
H  -2.481763 -1.76261 -0.883794
H  -1.377736 -2.867997 -0.000418
H  3.71214 0.254383 -0.000748
H  3.272637 -1.432384 -0.000767
H  -2.663316 1.845853 0.000191
