program: Gaussian 09
title: 000076098
version: EM64L-G09RevD.01
frameworkgroup: C1[X(C9H11N5O)]
method: RPBEPBE
basis: SDD
operation: Freq
keyword: #p
keyword: freq=noraman
keyword: PBEPBE/SDD
title: #p freq=noraman PBEPBE/SDD
converged: YES YES NO NO
title: Mulliken charges:
elementType: O N N N N N C C C C C C C C C H H H H H H H H H H H
charge: -0.240951 -0.158514 -0.406173 -0.109748 -0.018602 0.034469 -0.363137 -0.351947 -0.308059 -0.291023 0.247425 0.118396 -0.106788 -0.225479 -0.398137 0.281130 0.224769 0.240232 0.172822 0.227125 0.200148 0.193304 0.223007 0.307337 0.263332 0.245062
chargesum: 0.00000
title: Mulliken charges with hydrogens summed into heavy atoms:
elementType: O N N N N N C C C C C C C C C
charge: -0.240951 -0.158514 -0.098836 -0.109748 -0.018602 0.034469 0.142763 0.061107 0.119214 0.125288 0.247425 0.118396 -0.106788 0.037853 -0.153075
polarizability: 1.82198249e+02 -3.16774392e+00 1.49525539e+02 -5.14856148e+00 -1.41144322e-01 7.25968382e+01
1716.lowfreq: -24.0164 -6.6081 -0.0008 -0.0006 -0.0003 7.4523 9.7549 40.1904 109.7900
frequency: -21.6898 39.9032 109.7880 154.1866 215.1741 238.7065 258.2630 280.6711 303.7259 340.9980 392.9519 453.9405 495.2859 523.1865 549.3613 559.4923 568.6935 609.1866 620.8449 668.1204 673.2522 786.6571 788.5356 807.6669 827.1222 830.8097 872.9800 902.8784 906.9677 931.2199 995.3429 1013.7380 1048.0230 1073.1364 1077.2904 1089.5913 1107.1486 1114.1128 1183.9566 1189.1973 1220.8005 1246.9339 1251.5244 1276.6782 1289.2563 1295.4659 1320.6964 1332.2535 1343.2572 1346.1723 1350.1914 1369.4989 1399.4810 1420.2199 1446.8581 1452.0173 1453.1664 1460.1794 1466.6056 1510.9098 1582.8890 2945.3247 2958.3131 2959.1091 2971.9074 3081.5879 3092.7680 3095.6732 3105.7379 3160.8366 3231.6712 3601.2369
redmass: 3.6967 4.6519 5.2637 4.3816 5.6564 2.3067 3.3991 6.1057 4.6260 3.5909 1.8970 2.6954 5.3166 7.0895 1.4097 3.8717 3.8271 2.8817 3.0182 6.4601 5.7326 5.7820 5.0997 5.4746 1.7580 1.5870 4.7580 7.0962 2.3923 1.4252 2.7738 2.2806 2.1763 3.3586 2.5801 2.5384 2.4093 4.0600 2.0047 1.2674 1.6270 2.0179 1.6489 1.2209 5.7380 6.9371 1.4328 2.0794 1.6678 1.3309 1.5638 1.3016 2.3769 2.4646 1.0834 1.3259 1.1136 2.2791 1.1260 7.5547 7.8037 1.0701 1.0691 1.0690 1.0669 1.0967 1.0966 1.0941 1.0872 1.0919 1.0988 1.0815
irintensity: 4.5783 2.1618 4.0618 2.5794 0.7396 1.8250 26.2092 0.8854 6.7553 1.8626 0.7854 0.4101 13.5118 2.8514 104.9531 4.4743 5.1089 0.5789 11.5614 1.0468 4.2434 3.6296 14.3695 4.5825 2.3578 22.0125 19.0781 1.5030 15.6653 13.9745 52.3649 15.6236 32.0095 39.0616 55.6294 1.2270 4.0698 12.6008 0.3655 1.1298 24.9950 47.5276 91.8525 7.1898 9.1858 42.4218 2.0463 1.2272 115.1891 38.5761 8.4232 0.7334 37.8989 76.9500 4.3995 9.4370 25.6413 58.4029 33.7809 166.1518 418.4969 40.9112 41.8004 53.9344 89.3704 34.8256 39.0588 8.3951 36.9861 23.0224 1.4237 26.2155
temp: 298.150 k
press: 1.00000 atm
elementType: 8 7 7 7 7 7 6 6 6 6 6 6 6 6 6 1 1 1 1 1 1 1 1 1 1 1
symmnumber: 1
zpe: 536174.2 jmol-1
zpe.correction: 0.204218 hartree
zpe.thermalcorrener: 0.215172 hartree
zpe.thermalcorrenthalpy: 0.216116 hartree
zpe.thermalcorrgfe: 0.166958 hartree
zpe.sumelectzpe: -697.412675 hartree
zpe.sumelectthermal: -697.401722 hartree
zpe.sumelectthermalent: -697.400777 hartree
zpe.sumelectthermalfe: -697.449935 hartree
dipole: -4.8759 -4.5170 0.0879
dipole: 6.6473
quadrupole: -119.6384 -73.7083 -87.6266
quadrupole: -9.6680 1.1577 -0.5372
quadrupole: -25.9806 19.9494 6.0312 -9.6680 1.1577 -0.5372
hfenergy: -697.6168934 hartree
pointgroup: C01 [X(C9H11N5O1)]
dipole: 1.9726851 1.6818845 0.3452749 debye
dipolederiv: -0.5819797 0.0149591 0.0909034 -0.0233494 -0.7185662 -0.092199 0.1082463 -0.096868 -0.4680826 -1.7619675 -0.1513743 -0.1185104 -0.3974184 -0.4416265 -0.0348158 0.2185222 0.0179602 -0.3370956 -0.5580931 -0.1295122 -0.0479159 0.0180354 -0.497468 -0.0476303 -0.0550393 -0.0488666 -0.235076 -0.9546352 -0.0600882 -0.0648832 -0.5578943 -0.6250985 -0.1073069 -0.2167931 -0.0782312 -0.2474285 -0.3530403 0.0852087 0.0110166 -0.152473 -0.6120255 -0.0622987 -0.026935 -0.0436777 -0.2705842 -0.5924301 0.0890003 -0.0099681 -0.0943609 -0.6399157 -0.0712081 -0.0262514 -0.0851377 -0.224942 0.2704269 -0.2535302 0.0104919 -0.4866794 0.1566609 -0.0934239 -0.0246304 -0.1026429 0.2056593 0.190839 0.1540396 0.1648201 0.3883788 0.2997751 0.1098787 0.1822514 0.0778348 0.3193591 0.3383384 0.1442253 0.0509209 0.1721854 0.5159249 0.1030188 -0.0816719 0.1264812 0.4234022 0.4545094 -0.1975009 -0.0636283 -0.1041372 0.4656847 -0.0000771 -0.1370999 -0.0265617 0.3398562 2.1933352 0.1978522 0.1947324 0.3082861 0.3768955 0.0237647 0.1868094 0.0156223 0.1740806 -0.8888314 0.1062032 -0.0528458 0.2668747 0.2425911 0.0394848 0.0030585 0.0239957 0.0387654 0.4516072 -0.2693618 -0.0162684 0.1223167 0.6829733 0.0978698 0.0465065 0.0828262 0.0881685 0.6992189 0.16595 0.0743775 0.263143 0.2360633 0.0545305 0.081169 0.054056 -0.0372468 0.7603246 -0.0167733 0.0546165 0.1576943 0.5769795 0.1311235 0.072572 0.1297741 -0.0330828 0.1871238 -0.0681675 -0.0370438 0.0249547 0.0327962 -0.0485486 -0.000061 -0.0409736 0.069792 -0.071673 0.0620281 -0.0196522 0.1216843 0.0501681 0.032906 -0.0792432 0.1130789 -0.1326843 -0.0345026 -0.0525 -0.0802899 -0.0879617 0.0157669 0.0787293 -0.1570589 -0.0200771 -0.1549515 -0.033397 0.1517813 0.0360086 0.0932587 -0.0795881 -0.031373 0.0028156 -0.0081368 0.0764099 -0.0998747 0.1033297 0.0228858 0.0865388 -0.0510313 -0.0361252 -0.0137275 -0.0058485 0.0916718 0.0638211 -0.0466134 -0.0999799 -0.0319412 -0.0123067 0.0872504 -0.0201686 -0.0065996 -0.1804923 0.0056892 0.1069868 -0.041529 0.0553271 -0.0001132 0.0297983 -0.0217404 0.130517 -0.1569058 -0.0246065 -0.0695767 -0.0325165 -0.0647969 -0.0762891 -0.0779744 -0.0474316 -0.1179076 0.0326995 0.1580743 -0.0585387 -0.0153862 -0.0495088 0.2012905 -0.0190901 0.0126267 -0.0256252 0.3240624 0.1088111 0.0161787 -0.0029633 0.0216395 -0.009297 -0.0223079 -0.000589 -0.0238437 0.1751044 0.0729122 -0.0242057 -0.007393 -0.0497962 -0.0902439 -0.0439759 -0.0061365 -0.0411485 0.119541 unknown
polarizability: 181.9033841|-5.1302839|147.4202607|4.9810782|13.2123134|74.9969809 unknown
InChI: InChI=1S/C9H11N5O/c1-3-15-4-2-14(1)9-7-8(11-5-10-7)12-6-13-9/h5-6,10H,1-4H2
charge 0 multiplicity 1
26 atoms
O  4.094817 0.396724 -0.052818
N  1.280462 -0.218122 0.131791
N  -1.29601 1.842212 0.218838
N  -0.41675 -1.79769 -0.279092
N  -3.419864 1.036247 -0.036691
N  -2.821195 -1.338755 -0.361445
C  2.278154 -1.307103 -0.014595
C  1.839644 0.96903 0.806508
C  3.517474 -0.771753 -0.749721
C  3.092636 1.462835 0.050568
C  -0.076869 -0.494355 -0.014472
C  -1.151716 0.451707 0.049582
C  -2.499605 -0.028761 -0.119849
C  -2.664304 2.124083 0.159057
C  -1.731641 -2.142691 -0.441404
H  1.802717 -2.136012 -0.561383
H  2.570247 -1.680958 0.989174
H  2.129156 0.701442 1.845709
H  1.101813 1.782451 0.872843
H  4.320726 -1.525711 -0.766438
H  3.248978 -0.489235 -1.790089
H  2.802991 1.814914 -0.963891
H  3.585989 2.280928 0.601266
H  -0.562171 2.538502 0.325154
H  -3.048598 3.137096 0.26269
H  -1.917381 -3.199925 -0.653594
