program: Gaussian 09
title: 000076082
version: EM64L-G09RevD.01
frameworkgroup: C1[X(C7H9NO)]
method: RPBEPBE
basis: SDD
operation: Freq
keyword: #pfreq=noraman
keyword: PBEPBE/SDD
title: #p freq=noraman PBEPBE/SDD
converged: YES YES NO NO
title: Mulliken charges:
elementType: O N C C C C C C C H H H H H H H H H
charge: -0.426529 -0.720455 0.507510 0.078668 -0.494504 0.206872 -0.439961 -0.294044 -0.806953 0.251447 0.227811 0.232552 0.227625 0.234255 0.221798 0.307932 0.307609 0.378367
chargesum: 0.00000
title: Mulliken charges with hydrogens summed into heavy atoms:
elementType: O N C C C C C C C
charge: -0.048162 -0.104914 0.507510 0.078668 -0.243056 0.206872 -0.212150 -0.061492 -0.123276
polarizability: 1.15037811e+02 6.08055798e-01 9.19580711e+01 -2.54596512e-01 -8.57970388e-02 4.42234498e+01
1716.lowfreq: -15.7264 -9.5677 -0.0007 -0.0003 -0.0003 9.5136 11.6395 128.0421 155.5443
frequency: -11.3616 128.0355 155.5350 244.5362 285.5044 300.3791 317.7120 430.7035 437.4175 491.5665 576.3503 589.7006 708.0790 717.6079 728.9478 770.2808 799.9780 832.4257 876.7364 932.3172 936.9072 1000.4754 1045.6335 1115.5508 1141.3723 1149.3384 1187.1470 1255.6595 1268.5587 1305.9498 1379.8109 1396.3430 1454.0878 1471.0333 1474.5274 1500.8373 1582.4425 1632.2290 1634.5510 2976.6450 3057.1239 3085.5471 3120.5715 3144.4658 3152.1536 3179.6362 3451.5461 3563.9616
redmass: 1.0291 1.7999 1.8794 2.7482 3.2752 3.4872 3.4577 4.4041 2.7704 4.6900 5.1883 3.7696 2.0449 3.2759 2.3672 4.4126 1.2499 1.0775 1.4071 3.1123 1.3326 1.4917 1.5514 2.0432 1.3002 1.9040 1.4135 1.8503 2.4532 2.1357 3.8328 1.2747 3.0150 1.1078 1.0967 3.1808 3.2822 5.4018 1.3461 1.0380 1.0960 1.0994 1.0874 1.0961 1.0930 1.0615 1.0447 1.0978
irintensity: 0.7332 14.8551 0.0425 4.1564 8.8111 4.5999 2.5057 5.4006 13.0025 10.8231 1.3212 5.2827 89.6982 0.4411 83.6292 3.3936 26.1623 164.4701 8.0940 31.9203 1.7536 7.5410 17.5799 7.1697 1.6439 12.3615 49.3111 60.2423 92.5960 27.3172 49.0785 5.1839 7.5354 21.4693 26.9304 85.2307 32.1987 29.8461 40.0598 34.6078 22.9320 20.7102 8.8800 25.9101 1.1041 158.4864 1.2012 12.1665
temp: 298.150 k
press: 1.00000 atm
elementType: 8 7 6 6 6 6 6 6 6 1 1 1 1 1 1 1 1 1
symmnumber: 1
zpe: 382732.7 jmol-1
zpe.correction: 0.145775 hartree
zpe.thermalcorrener: 0.153740 hartree
zpe.thermalcorrenthalpy: 0.154684 hartree
zpe.thermalcorrgfe: 0.113535 hartree
zpe.sumelectzpe: -401.452945 hartree
zpe.sumelectthermal: -401.444981 hartree
zpe.sumelectthermalent: -401.444037 hartree
zpe.sumelectthermalfe: -401.485185 hartree
dipole: 0.7916 2.8156 0.0665
dipole: 2.9256
quadrupole: -41.6361 -53.6906 -55.2059
quadrupole: 7.1937 -0.0551 -0.0193
quadrupole: 8.5414 -3.5131 -5.0283 7.1937 -0.0551 -0.0193
hfenergy: -401.5987205 hartree
pointgroup: C01 [X(C7H9N1O1)]
dipole: -0.3087062 -1.1059878 0.079384 debye
dipolederiv: -0.9408414 0.4431805 -0.0241366 0.5922883 -0.7907775 0.024063 -0.0327178 0.0240279 -0.3976007 -0.7010959 0.0664138 -0.0081696 0.0072805 -0.5812705 0.0263506 -0.0023889 0.0273791 -0.1578888 0.4140329 -0.0076992 0.0175057 0.1776958 0.2328025 -0.0093983 0.0578606 -0.0000329 -0.0151225 0.4432019 0.0018101 -0.0001165 0.5496168 -0.0777905 -0.0031323 -0.0277038 -0.0035544 -0.1395935 -0.3714233 0.2744631 -0.0144543 0.0254292 0.0046242 -0.0048244 -0.0094105 -0.0080456 -0.2169154 0.6881206 -0.5450107 0.03197 -0.7138842 0.5663747 -0.0293811 0.0328544 -0.0311975 0.1078535 -0.3087357 -0.1148658 0.0063186 -0.2117626 -0.1444613 -0.0101501 0.0093194 -0.0088974 -0.2310898 0.135617 0.0547792 -0.002156 -0.0807405 0.0744554 -0.0060526 0.0011103 -0.0086624 -0.1239737 -0.1228845 -0.0515667 -0.0092515 -0.1032733 0.0621317 -0.000144 -0.0821204 -0.0134668 0.0672151 0.0678784 -0.0543382 0.0046404 -0.0566811 -0.0573029 0.0103852 0.0068653 0.0142526 0.1643993 -0.0372023 0.1120309 -0.0042206 0.099098 -0.0227839 0.0112131 -0.0007197 0.0083659 0.1641175 0.0564903 -0.0823524 0.0042198 -0.0759545 -0.0925975 0.0114577 0.0045559 0.0110836 0.1544727 0.0272646 -0.0167129 0.0115881 -0.0697504 -0.0275529 0.1236275 0.0815625 0.1149115 0.0057427 -0.0148298 -0.0334007 -0.0429795 -0.0472008 0.077246 -0.0742325 -0.0994932 -0.0765783 -0.0847052 -0.0035653 0.0504385 0.0226886 0.1524411 -0.0737166 -0.0514821 0.0455631 -0.0336193 0.0959558 0.1448694 -0.0507491 -0.0114206 -0.1264594 0.2293406 0.1031672 0.0146904 0.0521105 0.1273564 0.1445538 -0.0472313 0.0182383 -0.1209421 0.208802 -0.116294 0.0001156 -0.0639942 0.1496386 0.3785493 0.0008109 -0.0002643 0.0027991 0.4124764 -0.0051731 0.0000568 -0.0040824 0.3301379 unknown
polarizability: 115.0280659|0.7030175|91.8518215|0.685351|-2.2863642|44.3394449 unknown
InChI: InChI=1S/C7H9NO/c1-5-2-3-6(8)7(9)4-5/h2-4,9H,8H2,1H3
charge 0 multiplicity 1
18 atoms
O  -1.695889 1.846009 -0.115724
N  -2.651743 -0.646468 0.010445
C  1.585155 0.075093 -0.011779
C  -1.200854 -0.509127 0.010689
C  0.640302 1.130267 -0.069591
C  -0.738986 0.838839 -0.057373
C  1.124482 -1.267598 0.051804
C  -0.260979 -1.557057 0.064356
C  3.073693 0.383167 0.000609
H  0.963797 2.174978 -0.125245
H  1.852361 -2.085969 0.091463
H  -0.609028 -2.596077 0.112728
H  3.329807 1.172437 -0.728968
H  3.39691 0.74253 0.99672
H  3.67295 -0.511961 -0.24001
H  -3.052507 -1.00832 0.882329
H  -3.041944 -1.116881 -0.812987
H  -2.571329 1.332937 -0.097765
