program: Gaussian 09
title: 000076088
version: EM64L-G09RevD.01
frameworkgroup: C1[X(C14H27FO2)]
method: RPBEPBE
basis: SDD
operation: Freq
keyword: #p
keyword: freq=noraman
keyword: PBEPBE/SDD
title: #p freq=noraman PBEPBE/SDD
converged: YES YES NO NO
title: Mulliken charges:
elementType: F O O C C C C C C C C C C C C C C H H H H H H H H H H H H H H H H H H H H H H H H H H H
charge: -0.236143 -0.264889 -0.236345 -0.384450 -0.384437 -0.382705 -0.385188 -0.372494 -0.369215 -0.353747 -0.378266 -0.356367 -0.516865 -0.696758 0.243130 -0.244161 -0.212548 0.193380 0.194174 0.192884 0.193851 0.192508 0.191630 0.195418 0.196875 0.189225 0.190011 0.191858 0.191460 0.187385 0.187877 0.210717 0.222757 0.195244 0.194360 0.249516 0.246447 0.209521 0.209717 0.215032 0.254617 0.220171 0.217303 0.197512
chargesum: 0.00000
title: Mulliken charges with hydrogens summed into heavy atoms:
elementType: F O O C C C C C C C C C C C C C C
charge: -0.236143 -0.264889 -0.236345 0.003105 0.002298 0.001434 0.007105 0.006742 0.014103 0.021514 0.055208 0.033236 -0.020903 -0.062489 0.243130 0.230627 0.202266
polarizability: 2.19166949e+02 -3.79382040e-01 1.40120940e+02 2.31282664e+00 -1.99563686e+00 1.24983218e+02
1716.lowfreq: -39.4441 -4.8362 -0.0013 0.0012 0.0014 1.5295 10.0183 13.9176 21.1482
frequency: -32.8142 12.0619 21.0379 32.3392 36.5884 49.9994 54.7040 70.4000 80.9150 89.8989 111.8561 119.6352 129.0472 140.4722 148.2451 150.5010 180.7832 192.7220 233.8844 247.3938 276.0924 301.6655 334.3852 400.3862 429.6049 453.8876 482.7477 500.9330 551.2291 684.5305 717.0445 722.0822 726.1826 739.4308 767.8218 809.1726 813.6252 834.6174 862.7165 887.9565 914.2786 919.6511 974.6229 982.3966 998.0218 1003.3330 1017.7977 1024.9661 1036.5378 1048.7637 1061.1885 1077.0405 1080.1138 1081.9544 1088.1126 1105.1319 1107.3684 1121.3485 1131.0350 1181.3129 1193.0350 1204.0591 1205.1823 1231.4699 1236.4443 1240.9913 1257.7000 1264.5568 1278.0545 1278.9092 1286.7258 1289.5311 1293.4704 1297.0120 1298.5073 1318.5458 1338.9719 1351.2224 1351.9974 1356.2625 1360.2721 1368.7341 1386.4153 1388.3032 1439.2066 1446.5957 1451.1240 1458.4609 1458.6846 1462.4752 1463.8084 1466.2644 1471.3531 1476.7297 1477.4639 1481.9819 1486.9356 1488.4836 1645.9942 2947.4083 2948.0781 2949.8833 2952.1019 2952.8331 2958.0775 2964.0265 2966.3598 2970.5127 2980.2854 2982.9304 2984.8152 2989.9838 2994.2048 2997.2747 3005.2362 3007.7061 3019.7825 3021.4901 3030.0524 3035.2537 3041.2746 3063.0794 3066.7777 3069.3007 3077.6392 3095.7642
redmass: 1.9475 4.1136 4.6808 4.8333 4.1694 2.0814 4.9957 2.4190 1.9766 3.6445 2.3695 1.9249 3.4929 3.3387 1.9942 2.4131 3.3512 4.2809 1.1049 3.9722 2.9515 3.6705 3.4577 3.2065 3.5501 2.9450 2.9328 3.1095 2.7580 5.1778 1.0615 1.0682 1.0946 1.1415 1.2014 1.7056 2.0056 2.9646 1.2776 1.9073 6.0430 1.2634 1.4200 3.0709 4.0195 2.6965 2.6592 1.2533 2.5752 3.0286 2.8797 2.6861 2.0914 2.3039 2.4398 2.3322 1.8020 2.3625 2.8571 1.8629 1.0945 1.4873 1.3528 1.3883 1.3287 1.0987 1.2831 1.3279 1.0505 1.1465 1.0676 1.1541 1.2576 1.1077 1.1247 1.3976 1.4554 1.5733 1.6613 1.5814 1.5047 1.6022 1.3967 1.2167 1.0853 1.0784 1.0948 1.0722 1.0731 1.0715 1.0659 1.0780 1.0835 1.0737 1.0533 1.0902 1.0868 1.0976 9.8635 1.0585 1.0585 1.0590 1.0588 1.0594 1.0592 1.0588 1.0584 1.0365 1.0963 1.0638 1.0966 1.0978 1.0636 1.0985 1.0586 1.1031 1.1041 1.0591 1.1027 1.1003 1.1040 1.1025 1.1007 1.0993 1.1044 1.1081
irintensity: 0.3043 0.2268 0.0424 1.6052 2.5504 0.0534 0.7145 1.6090 1.3381 2.0521 0.6439 0.4650 1.6433 1.7142 0.0542 0.3547 6.3247 3.6256 0.0004 5.7376 1.7918 4.8813 0.7843 1.4858 1.3626 17.9325 0.5307 2.7069 2.3386 4.0685 13.8724 2.9610 10.9700 0.1059 3.3964 2.3430 3.3042 27.1484 2.4238 6.6342 45.2333 0.3344 1.8150 4.3568 2.4190 18.3979 17.8492 1.5209 14.9104 8.1783 21.6156 44.4209 0.2197 0.7388 19.7593 6.9430 86.7676 11.2560 206.2571 1.1657 6.2459 16.1284 27.1682 0.6483 16.7956 4.1002 0.0930 21.0718 0.0473 0.7398 0.4802 4.3854 13.5670 0.0019 1.2712 15.4697 12.1098 1.3962 1.4143 1.5909 0.5041 14.3175 9.3611 11.1271 24.7040 10.0419 10.9594 0.0208 0.0061 0.0653 0.1116 0.8853 0.7225 4.8150 10.7455 0.3300 2.6051 41.3109 164.2568 0.0079 0.4377 0.0500 1.6109 7.0059 5.6320 38.9790 235.5295 37.3302 0.1651 4.5808 0.3164 1.7519 37.1792 3.3579 7.7746 0.7011 5.3551 52.8042 1.6163 17.7129 201.3541 79.6815 99.3676 55.5805 14.8737 31.6775
temp: 298.150 k
press: 1.00000 atm
elementType: 9 8 8 6 6 6 6 6 6 6 6 6 6 6 6 6 6 1 1 1 1 1 1 1 1 1 1 1 1 1 1 1 1 1 1 1 1 1 1 1 1 1 1 1
symmnumber: 1
zpe: 1014897.7 jmol-1
zpe.correction: 0.386554 hartree
zpe.thermalcorrener: 0.407819 hartree
zpe.thermalcorrenthalpy: 0.408763 hartree
zpe.thermalcorrgfe: 0.331368 hartree
zpe.sumelectzpe: -798.575094 hartree
zpe.sumelectthermal: -798.553829 hartree
zpe.sumelectthermalent: -798.552885 hartree
zpe.sumelectthermalfe: -798.630280 hartree
dipole: -0.2429 -0.0511 2.0285
dipole: 2.0437
quadrupole: -102.6217 -114.9878 -103.9060
quadrupole: 6.5904 15.7915 -0.3162
quadrupole: 4.5501 -7.8160 3.2658 6.5904 15.7915 -0.3162
hfenergy: -798.961648 hartree
pointgroup: C01 [X(C14H27F1O2)]
dipole: 0.0939223 0.0089924 -0.7984819 debye
polarizability: 219.1752939|0.3896862|139.9568309|2.1297851|2.5417565|125.1389823 unknown
InChI: InChI=1S/C14H27FO2/c1-2-3-4-5-6-7-8-9-10-11-14(16)17-13-12-15/h2-13H2,1H3
charge 0 multiplicity 1
44 atoms
F  -8.051879 -1.471762 0.694635
O  -5.504659 -0.239192 -0.281428
O  -4.451461 1.729617 0.378691
C  3.334611 0.410858 0.06589
C  2.029144 -0.407393 -0.05343
C  4.612223 -0.44834 -0.067056
C  0.754399 0.463042 0.018953
C  5.915752 0.361854 0.113581
C  -0.552268 -0.358319 -0.056294
C  7.196085 -0.479971 -0.086128
C  -1.819225 0.52326 -0.006238
C  8.497888 0.323931 0.133922
C  -3.112818 -0.311555 -0.076807
C  9.773327 -0.515212 -0.096024
C  -4.372144 0.527751 0.039052
C  -6.81034 0.454011 -0.139876
C  -7.898645 -0.557006 -0.434884
H  3.344376 1.201509 -0.71353
H  3.347029 0.938638 1.042586
H  2.034819 -0.970026 -1.010656
H  2.000293 -1.168881 0.754005
H  4.583939 -1.267449 0.682031
H  4.620303 -0.939335 -1.062895
H  0.770172 1.203575 -0.807774
H  0.763364 1.049957 0.961032
H  5.92205 1.210558 -0.602599
H  5.927792 0.813121 1.1280
H  -0.573922 -1.085621 0.782463
H  -0.552666 -0.959702 -0.989769
H  7.198616 -0.905849 -1.111578
H  7.180259 -1.346109 0.608695
H  -1.802551 1.249029 -0.842571
H  -1.823507 1.126045 0.921633
H  8.502754 0.732367 1.16528
H  8.503788 1.20044 -0.546269
H  -3.135632 -1.05878 0.742502
H  -3.166084 -0.897179 -1.014117
H  9.807467 -0.908134 -1.129912
H  9.808237 -1.38141 0.591772
H  10.688448 0.083239 0.068259
H  -6.903241 0.864803 0.880876
H  -6.851251 1.295218 -0.858397
H  -7.652471 -1.169562 -1.31995
H  -8.870775 -0.047235 -0.568477
