program: Gaussian 09
title: 000076070
version: EM64L-G09RevD.01
frameworkgroup: C1[X(C8H8N2O6)]
method: RPBEPBE
basis: SDD
operation: Freq
keyword: #pfreq=noraman
keyword: PBEPBE/SDD
title: #p freq=noraman PBEPBE/SDD
converged: YES YES NO NO
title: Mulliken charges:
elementType: O O O O O O N N C C C C C C C C H H H H H H H H
charge: -0.199337 -0.413017 -0.188091 -0.164620 -0.205407 -0.196778 0.014737 0.021061 0.263328 0.284124 -0.281249 -0.473443 0.425293 -0.265433 -0.387301 -0.346985 0.265208 0.331002 0.222404 0.216390 0.293120 0.190804 0.257261 0.336926
chargesum: 0.00000
title: Mulliken charges with hydrogens summed into heavy atoms:
elementType: O O O O O O N N C C C C C C C C
charge: -0.199337 -0.076091 -0.188091 -0.164620 -0.205407 -0.196778 0.014737 0.021061 0.263328 0.284124 -0.016040 -0.142441 0.425293 0.173362 -0.094180 0.101080
polarizability: 1.99382256e+02 -2.98175761e+00 1.42695595e+02 1.27184722e+01 5.41374258e+00 6.87545676e+01
1716.lowfreq: -3.1510 0.0009 0.0009 0.0010 2.9382 5.7572 33.3794 44.0327 56.5982
frequency: 33.3618 44.0265 56.5906 59.9023 96.2215 108.7187 137.5013 149.4696 165.2061 220.7759 255.4435 292.0945 308.8045 328.3289 369.5116 381.3545 446.4842 483.3362 501.2629 518.4662 591.4670 634.1242 652.8031 673.6790 710.1870 745.2781 750.4751 757.8162 826.2494 857.8316 867.6247 902.2878 952.6780 982.3437 1002.0026 1019.1550 1057.1774 1070.2631 1115.6079 1148.0113 1166.2439 1205.8525 1218.6252 1246.2192 1258.4460 1265.2402 1334.8294 1358.6746 1369.0587 1376.9375 1388.1172 1400.1681 1432.1111 1447.4697 1453.2895 1479.5238 1584.1790 1611.7679 2956.4025 2969.6642 3032.9486 3101.4785 3171.8064 3187.5838 3189.7045 3558.7460
redmass: 6.7853 11.5545 8.6967 6.0355 4.4404 5.3456 4.9966 8.2901 3.9066 2.2538 6.1597 6.0096 2.1880 5.5095 4.7856 4.0975 4.4934 3.6712 4.6762 4.8939 5.9028 7.0696 6.9244 7.8562 6.8259 5.3313 4.1395 9.3940 1.6027 4.1077 3.1338 4.1498 1.4661 1.3532 2.1584 2.0728 2.1639 2.8374 4.8698 1.3085 1.1748 9.5194 7.5303 1.6942 1.5510 1.8160 1.2365 5.3272 1.4428 11.4969 1.3339 5.5148 5.7883 1.0807 1.2013 2.4234 8.8608 7.1674 1.0607 1.0643 1.1073 1.0942 1.0882 1.0930 1.0964 1.0666
irintensity: 1.7881 1.3551 2.5324 1.4311 5.5295 7.5733 4.7106 3.5357 6.0216 70.2338 11.2251 19.9664 88.4535 15.0380 3.8218 3.9984 0.4296 12.9980 5.2492 3.8899 1.4146 20.2834 26.2010 26.9256 10.4898 7.3587 3.3978 14.1697 31.2018 9.6879 29.5266 89.1500 24.6966 0.4876 46.6733 56.1109 50.5943 7.6169 7.8100 50.6858 45.8991 374.9448 266.4393 113.5631 118.1268 35.2402 4.6212 71.5438 20.6787 84.3117 12.4337 73.8878 12.9038 2.0950 68.2527 61.5026 23.9744 194.6759 10.4721 89.6245 32.8313 11.4818 3.2893 10.1933 11.3552 7.6354
temp: 298.150 k
press: 1.00000 atm
elementType: 8 8 8 8 8 8 7 7 6 6 6 6 6 6 6 6 1 1 1 1 1 1 1 1
symmnumber: 1
zpe: 430889.0 jmol-1
zpe.correction: 0.164117 hartree
zpe.thermalcorrener: 0.179159 hartree
zpe.thermalcorrenthalpy: 0.180103 hartree
zpe.thermalcorrgfe: 0.119899 hartree
zpe.sumelectzpe: -869.105064 hartree
zpe.sumelectthermal: -869.090022 hartree
zpe.sumelectthermalent: -869.089078 hartree
zpe.sumelectthermalfe: -869.149282 hartree
dipole: -4.8141 -7.4731 -0.9216
dipole: 8.9371
quadrupole: -111.2425 -93.8019 -89.8304
quadrupole: 20.8225 -0.7337 -1.9969
quadrupole: -12.9509 4.4897 8.4612 20.8225 -0.7337 -1.9969
hfenergy: -869.2691806 hartree
pointgroup: C01 [X(C8H8N2O6)]
dipole: 1.7619724 2.9712419 -0.6560519 debye
dipolederiv: -1.9941256 -0.5404511 0.2011759 -0.3400192 -0.2977138 0.0482557 0.2039642 0.0507209 -0.242915 -0.8263248 -0.0531942 -0.0721565 0.0125157 -0.1107705 0.1213956 -0.2100091 0.1397042 -0.6544344 -0.332458 -0.0023086 0.1605603 -0.0013627 -0.7244875 0.234449 0.1526864 0.1619364 -0.4536018 -0.4932707 0.1566081 0.2557713 0.2111886 -0.492091 -0.036747 0.2060032 0.0601013 -0.4431714 -0.7790876 0.2284208 0.0467909 0.3118628 -0.6602091 0.007044 0.0392057 0.0213458 -0.2347214 -0.7736361 -0.1622528 0.0898771 -0.2842583 -0.61748 0.0743437 0.1102959 0.0679806 -0.2406266 0.6648286 -0.392834 -0.4683539 -0.366865 1.3920626 -0.2440982 -0.3645001 -0.2538438 0.7274563 2.0565125 -0.0866675 -0.2295406 -0.0360479 1.0189395 -0.0829079 -0.2601215 -0.0929226 0.2293302 1.7337031 0.4340675 -0.1348605 -0.2105595 0.1510509 0.0290026 -0.063121 -0.1176533 0.1485928 -0.5080268 0.2080854 0.0941937 -0.1821198 -0.3475127 0.0676813 0.105139 0.0234702 -0.0437821 -0.6364918 -0.0314766 0.0353896 0.4896196 0.0230026 -0.0739809 -0.0164343 -0.0165889 -0.1715002 0.3844031 -0.2363889 -0.0177852 -0.2779503 0.0434527 0.0120343 -0.070836 0.10098 -0.0483205 -0.9107584 0.0272805 0.1036154 0.0242643 -0.2732869 0.0315928 0.119389 0.0406669 0.0222126 0.724205 0.3079093 -0.1449587 0.7646605 0.4915047 -0.0227381 -0.1260031 -0.0351208 0.3201685 0.4259869 0.126542 -0.0654675 0.2464176 0.1146699 -0.0556753 -0.0845382 -0.0376255 -0.0605851 0.5172936 0.0191606 0.1463288 0.004602 0.2214998 -0.1037296 0.2334066 -0.0874095 0.5956118 0.0386203 -0.0729262 0.0280953 -0.0760337 -0.004044 0.0268762 0.0142331 0.0264554 0.1555725 0.1556196 -0.0221259 -0.0039789 0.0050628 0.127194 0.0051129 0.0249303 -0.0058144 0.1730301 -0.0404691 0.0152826 -0.083956 -0.1301647 -0.0162896 0.0751821 -0.0156363 0.0986237 -0.0980403 -0.0150479 0.0292524 0.0482748 -0.1347928 -0.0798915 -0.0605232 0.0335272 -0.1065246 -0.041987 0.116536 0.0517826 -0.0017886 0.0170639 0.0751899 0.0094523 0.0091487 -0.0014198 0.1664365 -0.0798006 -0.0907375 0.0243346 -0.1181803 -0.0791179 0.1552749 -0.0096628 0.0875442 -0.0388277 0.1218717 0.0113611 -0.0231317 0.0505385 0.0102308 -0.0951089 -0.0457687 -0.0487419 0.0028378 0.4499169 0.0756103 0.0115704 0.0205578 0.0340971 -0.1221883 0.0147017 -0.0758644 0.2312642 unknown
polarizability: 197.5587465|-2.5472527|141.5489206|-20.1206685|-10.2413506|71.724751 unknown
InChI: InChI=1S/C8H8N2O6/c11-3-4-16-8-2-1-6(9(12)13)5-7(8)10(14)15/h1-2,5,11H,3-4H2
charge 0 multiplicity 1
24 atoms
O  2.005934 0.231048 -0.404254
O  4.748568 0.661798 0.76113
O  0.091642 -3.091801 0.759138
O  1.53528 -2.416711 -0.877035
O  -4.218526 1.538615 0.23998
O  -4.226336 -0.730674 0.502721
N  0.568538 -2.209168 -0.055365
N  -3.62531 0.391163 0.288374
C  0.640041 0.326076 -0.294362
C  -0.096197 -0.881616 -0.068128
C  -0.084824 1.550859 -0.347111
C  -1.482638 -0.865403 0.144512
C  -2.161913 0.365876 0.084548
C  2.805393 1.462334 -0.602301
C  -1.475512 1.574201 -0.16664
C  4.278017 1.047397 -0.567049
H  0.441308 2.490469 -0.530883
H  -2.023412 -1.793172 0.348596
H  2.548686 1.897366 -1.589698
H  2.572296 2.193915 0.198207
H  -2.041195 2.508599 -0.21049
H  4.882423 1.876348 -0.995421
H  4.416232 0.14931 -1.189705
H  4.793102 1.457572 1.349737
