program: Gaussian 09
title: 000076050
version: EM64L-G09RevD.01
frameworkgroup: C1[X(C10H12O4)]
method: RPBEPBE
basis: SDD
operation: Freq
keyword: #pfreq=noraman
keyword: PBEPBE/SDD
title: #p freq=noraman PBEPBE/SDD
converged: YES YES NO NO
title: Mulliken charges:
elementType: O O O O C C C C C C C C C C H H H H H H H H H H H H
charge: -0.265599 -0.265598 -0.245085 -0.245086 -0.344010 -0.344010 -0.268539 -0.268538 0.263195 0.263196 -0.039596 -0.039596 -0.547238 -0.547240 0.232562 0.246119 0.232564 0.246118 0.287269 0.287269 0.235178 0.235177 0.224536 0.221207 0.224535 0.221208
chargesum: 0.00000
title: Mulliken charges with hydrogens summed into heavy atoms:
elementType: O O O O C C C C C C C C C C
charge: -0.265599 -0.265598 -0.245085 -0.245086 0.134671 0.134672 0.018731 0.018732 0.263195 0.263196 0.195581 0.195581 -0.101494 -0.101496
polarizability: 2.39717753e+02 -1.83508247e+01 9.84530473e+01 -1.60764731e-04 -1.64311843e-04 7.52205743e+01
1716.lowfreq: -1.4730 -0.0004 -0.0003 0.0008 2.7657 7.2199 14.1538 20.3428 40.4432
frequency: 14.1142 19.5618 40.4405 40.5768 68.5169 75.7041 83.0582 117.1292 150.6420 197.0598 210.9904 237.5297 240.7089 290.5104 320.2064 333.6107 389.9629 447.2689 514.7576 608.9148 627.2234 634.4243 640.3009 723.5777 731.7915 846.4994 872.9673 919.5582 921.8351 933.0930 938.6476 948.7134 962.6510 963.1734 986.8754 991.4473 1012.7779 1013.4696 1013.7685 1121.9241 1123.7493 1152.5692 1153.3789 1216.9130 1217.1129 1272.5043 1282.8594 1286.0378 1287.3661 1335.5627 1339.3263 1433.7375 1433.9128 1467.3547 1467.4118 1611.8822 1616.4066 1659.2619 1665.5376 1665.5885 2999.7524 2999.7963 3069.0360 3069.0572 3094.8566 3094.8669 3122.8544 3122.8756 3162.5834 3166.4649 3205.6600 3205.6782
redmass: 3.8419 3.8242 3.3242 4.9285 3.5096 2.5835 4.4070 3.5042 3.7430 2.8312 5.8407 3.5816 5.4488 6.6288 3.5484 3.2347 2.5153 2.2126 2.6427 4.0544 1.6586 4.2316 2.2396 10.6617 5.9278 4.4686 3.4754 2.1238 1.9768 1.6302 2.3826 2.7653 1.3630 1.3861 1.7703 1.7600 1.1578 1.3937 1.4906 4.2879 2.0998 1.7410 1.8147 1.2245 1.2253 1.7011 1.3138 1.2888 1.3663 1.3505 1.4278 1.1890 1.1920 1.0979 1.0978 11.4038 10.6171 6.6437 4.7250 4.7356 1.0577 1.0577 1.1053 1.1053 1.0609 1.0609 1.0951 1.0951 1.0991 1.0867 1.1144 1.1144
irintensity: 0.1598 0.0184 4.0338 0.7585 0.1967 0.6840 0.0109 2.5903 0.5548 4.8539 1.8705 6.2642 11.5857 0.0916 36.8392 2.4796 7.2710 2.1635 0.2771 0.3382 5.1839 2.0681 23.7987 15.6090 0.0170 20.1793 0.0058 0.4985 16.2065 7.5063 307.7593 0.1338 23.0415 97.4082 185.1048 5.5173 55.8865 5.0290 19.8915 0.0001 540.6635 28.2942 0.5727 1.3564 0.9994 533.6688 0.2950 54.5475 0.0730 0.2068 31.1804 6.0093 19.4765 4.0161 21.0752 312.2952 0.0145 0.0151 8.7748 1.6282 29.9484 1.1150 0.4882 23.8856 7.5349 11.1919 4.5557 14.0806 0.0001 1.2841 19.7757 26.8087
temp: 298.150 k
press: 1.00000 atm
elementType: 8 8 8 8 6 6 6 6 6 6 6 6 6 6 1 1 1 1 1 1 1 1 1 1 1 1
symmnumber: 1
zpe: 521619.3 jmol-1
zpe.correction: 0.198674 hartree
zpe.thermalcorrener: 0.214479 hartree
zpe.thermalcorrenthalpy: 0.215424 hartree
zpe.thermalcorrgfe: 0.151145 hartree
zpe.sumelectzpe: -688.037405 hartree
zpe.sumelectthermal: -688.021600 hartree
zpe.sumelectthermalent: -688.020655 hartree
zpe.sumelectthermalfe: -688.084934 hartree
dipole: 0.0000 0.0000 0.2322
dipole: 0.2322
quadrupole: -52.0444 -93.5188 -78.3833
quadrupole: -3.6119 0.0000 -0.0001
quadrupole: 22.6044 -18.8699 -3.7345 -3.6119 0.0000 -0.0001
hfenergy: -688.236079 hartree
pointgroup: C01 [X(C10H12O4)]
dipole: -0.0000086 0.000043 -0.0913389 debye
dipolederiv: -1.9153757 -0.3406598 -0.0190435 -0.3061219 -0.5374998 0.0091253 -0.1366575 -0.0341543 -0.2730548 -1.9153591 -0.3406724 0.0188433 -0.3062408 -0.5375225 -0.0093199 0.1365143 0.0339724 -0.2730408 -0.8138016 0.0641971 0.0025455 -0.1005042 -0.9130171 0.0005683 -0.0287879 -0.0048901 -0.3150071 -0.8137974 0.0642016 -0.0024788 -0.1005257 -0.9130188 -0.0010081 0.0287219 0.0044153 -0.315006 1.0734132 0.0455323 -0.009531 -0.2837161 0.199736 -0.0628379 0.1945126 0.0251666 0.2988022 1.0734043 0.0455231 0.0095326 -0.2835384 0.1997087 0.0627764 -0.1947653 -0.0252404 0.298845 -0.4995837 0.0920558 -0.0021001 0.1815397 0.0112623 -0.0034567 0.0351195 0.0058295 -0.1095928 -0.4995846 0.0920523 0.0021864 0.1815652 0.0112633 0.0035426 -0.0349865 -0.0057353 -0.1095931 2.174092 0.1392018 -0.000675 0.3073791 1.1575274 0.0060127 -0.0069066 -0.0062006 0.2470563 2.174087 0.1391999 0.0007107 0.3073709 1.1575271 -0.00534 0.0070806 0.0068917 0.2470573 0.0032752 0.1201401 -0.0617194 0.2000927 -0.079178 0.1113979 0.0047022 0.1168379 0.0795093 0.003287 0.120085 0.0618231 0.2000886 -0.0789868 -0.1115374 -0.0045354 -0.1169746 0.0793193 -0.2303381 0.0937966 -0.0262028 0.1002247 -0.218164 0.1770669 -0.0800536 0.1743373 0.0077534 -0.2303372 0.0937663 0.0262924 0.1001516 -0.2178746 -0.1772578 0.0801492 -0.1745273 0.0074619 -0.0862726 0.0120569 0.0311066 0.051804 0.0746791 -0.0294686 0.0089032 -0.0743933 -0.0942603 -0.0447196 -0.0721649 0.0369554 0.073695 0.0001853 0.0696454 -0.0342854 0.0684184 0.0384757 -0.0862755 0.0120834 -0.0310923 0.0518113 0.0745934 0.0296037 -0.0088614 0.0745278 -0.0941738 -0.0447303 -0.0721379 -0.0370098 0.07366 0.0002943 -0.0696814 0.0343444 -0.0684483 0.0383607 0.1214373 0.003981 -0.0002533 0.0243187 0.0131377 0.0003158 -0.0022801 -0.0000403 0.1711153 0.1214375 0.0039807 0.0002568 0.0243169 0.0131378 -0.0004382 0.0022935 -0.0000797 0.171115 0.1033275 -0.0132265 0.0592488 -0.0869091 0.0843711 -0.0846469 0.0348761 -0.0898674 -0.0567148 0.1033234 -0.0131717 -0.0592682 -0.086875 0.084227 0.0847664 -0.0349565 0.089983 -0.0565677 -0.0031556 -0.1106749 -0.034938 -0.1424749 0.0867806 -0.0798477 -0.0322224 -0.0832869 0.0659726 0.1177012 -0.0342362 0.0259547 -0.0193318 0.1201796 -0.1147875 0.0543228 -0.097108 -0.0600558 -0.0031516 -0.1107001 0.03485 -0.1424978 0.0866441 0.0798724 0.0321088 0.0833101 0.0661016 0.117697 -0.0342096 -0.0259944 -0.0192829 0.1200066 0.1149344 -0.0543504 0.0972565 -0.0598785 unknown
polarizability: 239.7887262|18.075446|98.3820713|0.004389|0.0084121|75.2205774 unknown
InChI: InChI=1S/C10H12O4/c1-3-7-13-9(11)5-6-10(12)14-8-4-2/h3-6H,1-2,7-8H2
charge 0 multiplicity 1
26 atoms
O  -2.983458 -0.173096 0.164268
O  2.983499 0.172608 0.164295
O  -1.834435 1.869014 0.171801
O  1.834484 -1.86951 0.170304
C  -4.287144 0.57244 0.15477
C  4.287184 -0.572919 0.154161
C  -0.627521 -0.263658 0.169619
C  0.627562 0.263161 0.169809
C  -1.826107 0.613168 0.169286
C  1.826151 -0.613662 0.168784
C  -5.327831 -0.345685 -0.419711
C  5.327848 0.345679 -0.419607
C  -6.492198 -0.64967 0.204264
C  6.492243 0.64916 0.204558
H  -4.518661 0.869686 1.193003
H  -4.144006 1.487694 -0.450906
H  4.518729 -0.871008 1.192145
H  4.144035 -1.48768 -0.452258
H  -0.786277 -1.34717 0.170437
H  0.786317 1.346672 0.171454
H  -5.108081 -0.750294 -1.416789
H  5.108047 0.751107 -1.416342
H  -7.244505 -1.289543 -0.26876
H  -6.72865 -0.264694 1.204015
H  7.24452 1.289428 -0.267981
H  6.728755 0.263371 1.203982
