program: Gaussian 09
title: 000076263
version: EM64L-G09RevD.01
frameworkgroup: C1[X(C26H18N2O2)]
method: RPBEPBE
basis: SDD
operation: Freq
keyword: #p
keyword: freq=noraman
keyword: PBEPBE/SDD
title: #p freq=noraman PBEPBE/SDD
converged: YES YES NO NO
title: Mulliken charges:
elementType: O O N N C C C C C C C C C C C C C C C C C C C C C C C C C C H H H H H H H H H H H H H H H H H H
charge: -0.324532 -0.324560 -0.486067 -0.486043 0.082514 0.082516 0.269210 0.269312 0.291454 0.291464 -0.145571 -0.145579 -0.408037 -0.407978 -0.392222 -0.392220 -0.231127 -0.231128 0.427315 0.427395 -0.428213 -0.428212 -0.381498 -0.381562 -0.196741 -0.196741 -0.219617 -0.219674 -0.252085 -0.252088 0.280471 0.280509 0.378833 0.378850 0.292871 0.292871 0.235757 0.235757 0.250511 0.250506 0.267446 0.267493 0.229474 0.229475 0.227850 0.227849 0.231896 0.231894
chargesum: 0.00000
title: Mulliken charges with hydrogens summed into heavy atoms:
elementType: O O N N C C C C C C C C C C C C C C C C C C C C C C C C C C
charge: -0.324532 -0.324560 -0.107234 -0.107193 0.082514 0.082516 0.269210 0.269312 0.291454 0.291464 -0.145571 -0.145579 -0.127566 -0.127468 -0.099350 -0.099349 0.004630 0.004629 0.427315 0.427395 -0.177702 -0.177707 -0.114051 -0.114069 0.032733 0.032734 0.008233 0.008175 -0.020189 -0.020193
polarizability: 5.19981444e+02 8.71379463e-04 5.50723949e+02 -1.11675936e-02 -1.11352937e+01 1.40834448e+02
1716.lowfreq: -4.1726 -2.0059 -0.0008 -0.0007 -0.0006 3.5769 30.2545 34.3202 35.7053
frequency: 30.2432 34.2967 35.7053 42.7794 46.9428 81.6237 86.2494 99.0875 148.5001 157.3524 159.2138 187.9069 198.8698 212.4865 249.5061 249.5933 270.8687 326.4797 328.6242 381.9126 382.4658 407.8308 409.6676 415.8187 427.4631 428.5263 435.9423 453.4704 474.1845 496.2071 502.2854 511.6996 557.4487 571.2126 582.5167 612.1680 612.5114 627.9754 629.5878 663.8446 678.1256 694.3351 699.1118 708.2802 725.6067 726.7247 748.6652 760.9280 784.2292 798.3456 805.1815 813.8612 831.1894 839.7313 851.5121 852.3368 871.0315 890.9171 903.6769 907.4914 926.4068 930.9686 935.3780 964.5983 966.6148 971.5362 985.3338 985.9732 987.3199 989.3020 997.0608 998.0763 1013.0469 1020.8672 1027.0935 1027.1900 1070.1517 1086.3478 1086.9861 1087.1873 1163.8226 1166.8760 1172.4713 1172.4900 1183.8259 1187.7105 1192.9226 1237.6761 1245.5735 1248.8439 1264.4246 1300.0597 1319.3067 1320.5627 1328.2842 1328.4326 1368.0358 1379.4634 1380.0229 1382.9563 1386.0619 1404.5099 1441.2733 1442.0803 1453.7623 1456.4857 1474.8930 1483.9737 1490.6076 1502.3645 1519.5652 1564.5758 1580.3631 1582.9059 1604.0071 1607.3527 1608.7244 1609.8981 1615.9099 1634.4716 2941.0636 2948.8190 3128.7412 3128.8285 3133.7269 3134.3644 3134.4557 3148.1795 3148.5151 3151.3254 3153.9939 3156.4385 3159.8721 3165.6622 3170.1696 3170.5550 3172.9212 3178.2634
redmass: 5.7766 5.2914 4.2240 5.0787 4.4698 5.0424 6.4161 4.9282 5.7485 5.6871 6.1578 5.7968 6.2009 5.6597 6.1910 5.4374 5.1493 5.3267 5.6831 7.6891 6.9168 3.1988 2.9549 5.3317 3.5614 5.5503 11.4692 7.6925 9.7559 3.5845 3.4022 3.9725 6.6645 3.7566 7.2851 6.1971 6.3800 6.6522 5.8099 5.0972 5.3938 2.1641 1.9658 6.4043 6.0280 2.4841 1.8961 1.8826 4.0643 3.1419 1.8134 3.9859 1.5212 1.2946 3.0543 1.3931 4.8710 3.0911 1.5616 1.3607 1.6171 1.2829 1.5266 2.5980 1.8680 1.3831 1.9706 5.5252 2.3059 1.3097 1.3858 1.2943 1.3569 2.6943 2.0485 2.1198 2.4615 1.5874 2.4559 1.5660 2.3479 1.1031 1.0525 1.0513 1.2038 1.1110 1.3321 3.4151 1.6441 2.4332 1.9469 2.5297 2.0898 1.7011 1.5549 3.2650 5.5923 6.4458 4.1445 3.6271 8.0187 9.5590 2.8967 2.4140 3.1244 3.5538 2.9939 2.3927 3.0444 8.0596 4.2842 3.4553 4.8709 6.4699 3.2432 4.9524 6.4227 3.2388 2.7531 4.4288 1.0854 1.0844 1.0848 1.0848 1.0863 1.0881 1.0882 1.0924 1.0929 1.0908 1.0926 1.0961 1.0911 1.0943 1.1015 1.1013 1.0993 1.0967
irintensity: 0.8435 0.0003 0.5170 0.9418 0.8520 0.0193 2.3689 0.2877 0.0024 0.4817 3.1358 0.4468 0.2990 0.6185 1.2781 0.8818 5.5667 4.7880 2.3439 0.2816 6.6238 0.5531 1.0041 0.2911 2.4587 1.1359 9.3627 3.7543 17.6747 8.7595 13.4059 20.5429 0.7832 27.4620 19.2497 2.3972 0.2694 0.1405 0.0446 2.5317 7.8496 26.2807 60.9008 2.7419 0.5192 46.6552 8.4574 88.0889 2.3673 21.3384 51.0045 1.8432 13.2070 0.0793 0.0010 18.7043 21.4440 11.7160 0.0649 37.5899 11.9457 151.8218 24.7972 0.8650 1.6825 1.5339 0.0940 1.3938 0.2844 1.3624 6.0682 0.8629 0.0095 52.0254 12.8005 1.2565 15.2978 8.1814 4.3969 9.6869 7.7041 0.3379 0.5532 0.1543 34.4824 0.0011 19.8686 25.8816 4.6729 2.3006 36.9294 37.5564 61.6617 171.1043 24.0331 717.8710 0.9323 1.8027 5.5427 7.1367 21.5001 19.8716 4.5316 4.9089 29.3429 6.2691 9.3002 89.3505 93.9480 277.0307 776.3361 44.5494 7.0768 39.5281 190.0120 189.8105 0.2276 29.7356 7.4117 112.5810 83.6184 1.1250 10.2819 9.9234 3.9064 1.6201 3.6186 6.5315 32.5281 18.5978 19.8427 15.8629 23.2274 1.6634 22.3127 25.8658 37.4721 4.4864
temp: 298.150 k
press: 1.00000 atm
elementType: 8 8 7 7 6 6 6 6 6 6 6 6 6 6 6 6 6 6 6 6 6 6 6 6 6 6 6 6 6 6 1 1 1 1 1 1 1 1 1 1 1 1 1 1 1 1 1 1
symmnumber: 1
zpe: 966661.8 jmol-1
zpe.correction: 0.368182 hartree
zpe.thermalcorrener: 0.390950 hartree
zpe.thermalcorrenthalpy: 0.391894 hartree
zpe.thermalcorrgfe: 0.314917 hartree
zpe.sumelectzpe: -1259.556789 hartree
zpe.sumelectthermal: -1259.534021 hartree
zpe.sumelectthermalent: -1259.533077 hartree
zpe.sumelectthermalfe: -1259.610054 hartree
dipole: 0.0003 -2.8056 0.0027
dipole: 2.8056
quadrupole: -159.1349 -145.7514 -176.8245
quadrupole: -0.0045 0.0028 -3.7842
quadrupole: 1.4353 14.8188 -16.2542 -0.0045 0.0028 -3.7842
hfenergy: -1259.9249709 hartree
pointgroup: C01[X(C26H18N2O2)]
dipole: -0.0005152 -1.1034315 -0.0281914 debye
polarizability: 519.9814481|0.010167|549.9295817|0.0050398|21.1888013|141.6288117 unknown
InChI: InChI=1S/C26H18N2O2/c29-25-19-13-7-8-14-20(19)26(30)24-22(28-18-11-5-2-6-12-18)16-15-21(23(24)25)27-17-9-3-1-4-10-17/h1-16,27-28H
charge 0 multiplicity 1
48 atoms
O  -2.769783 2.059087 0.109808
O  2.771491 2.056882 0.108823
N  -2.828974 -0.492135 0.162408
N  2.828741 -0.494226 0.162208
C  -0.724351 0.754406 0.123036
C  0.725043 0.753865 0.122941
C  -1.444782 -0.494354 0.179484
C  1.444566 -0.495411 0.179361
C  -0.711234 3.287737 -0.028049
C  0.713852 3.287187 -0.028186
C  -1.466513 2.018929 0.070254
C  1.468161 2.017806 0.070118
C  -0.692986 -1.710368 0.343624
C  0.691915 -1.710878 0.343558
C  -1.413861 4.518253 -0.11275
C  1.417421 4.517151 -0.113063
C  -0.708402 5.731799 -0.201611
C  0.712891 5.731246 -0.201773
C  -3.719982 -1.585856 0.016531
C  3.718841 -1.588715 0.016667
C  -4.986042 -1.496073 0.659934
C  4.985217 -1.49954 0.659536
C  -3.439883 -2.715453 -0.802708
C  3.437465 -2.718637 -0.801673
C  -5.939267 -2.522566 0.504875
C  5.937564 -2.526883 0.504734
C  -4.39715 -3.742427 -0.942182
C  4.393854 -3.746467 -0.94087
C  -5.64842 -3.658076 -0.28816
C  5.64548 -3.662669 -0.287456
H  -1.229357 -2.644607 0.528452
H  1.227642 -2.645512 0.52829
H  -3.212911 0.491036 0.203763
H  3.213476 0.488654 0.203197
H  -2.507416 4.48716 -0.106743
H  2.510953 4.485207 -0.107256
H  -1.254165 6.679055 -0.270355
H  1.259374 6.678079 -0.270629
H  -5.205891 -0.623327 1.285027
H  5.206011 -0.626568 1.283982
H  -2.501916 -2.767178 -1.364087
H  2.499157 -2.770019 -1.362522
H  -6.908295 -2.439016 1.009149
H  6.906866 -2.443783 1.008555
H  -4.170564 -4.603034 -1.581609
H  4.166292 -4.607335 -1.5796
H  -6.388488 -4.456783 -0.403924
H  6.38486 -4.462043 -0.403009
