program: Gaussian 09
title: 000076039
version: EM64L-G09RevD.01
frameworkgroup: C1[X(C10H17NO)]
method: RPBEPBE
basis: SDD
operation: Freq
keyword: #p
keyword: freq=noraman
keyword: PBEPBE/SDD
title: #p freq=noraman PBEPBE/SDD
converged: YES YES NO NO
title: Mulliken charges:
elementType: O N C C C C C C C C C C H H H H H H H H H H H H H H H H H
charge: -0.441232 -0.066232 0.344696 0.238534 -0.215883 -0.529175 -0.479987 -0.537316 0.038649 -0.787504 -0.770108 -0.808817 0.242774 0.236854 0.234119 0.212162 0.230649 0.262099 0.235673 0.215354 0.215469 0.234426 0.242472 0.212536 0.214264 0.226772 0.207260 0.231623 0.359870
chargesum: 0.00000
title: Mulliken charges with hydrogens summed into heavy atoms:
elementType: O N C C C C C C C C C C
charge: -0.081362 -0.066232 0.344696 0.238534 0.026890 -0.058202 -0.037177 -0.039543 0.038649 -0.122256 -0.100836 -0.143162
polarizability: 1.34219599e+02 -2.49646587e+00 1.05914219e+02 -1.05468042e+00 -2.31349736e+00 1.00767080e+02
1716.lowfreq: -15.7526 -10.8582 -0.0006 -0.0002 0.0008 7.5220 74.5217 140.9332 170.0710
frequency: 74.4007 140.8707 170.0701 186.8722 207.9729 215.0781 236.9197 245.0376 258.2831 300.6406 312.1972 372.6617 383.0272 404.2337 424.0182 462.8582 521.0661 546.2079 568.4378 600.5082 654.8046 712.2745 757.1740 811.3539 837.9620 855.2108 870.7485 908.5586 928.8840 937.3342 944.8018 955.4318 989.5659 1013.1231 1030.3113 1065.6502 1089.9429 1101.6214 1126.1371 1155.8196 1167.7233 1189.1473 1198.3667 1217.7925 1227.2600 1236.8545 1266.9493 1276.5950 1290.2269 1302.9556 1332.0198 1379.6621 1388.7895 1400.2860 1449.2237 1457.7263 1465.9377 1466.4733 1473.8030 1481.5856 1486.3010 1490.0458 1499.4097 1639.7386 2976.3595 2980.2057 2984.9705 2999.3937 3006.4825 3012.8956 3052.9988 3054.8571 3057.3647 3059.4258 3064.5694 3075.5634 3078.3181 3082.4444 3084.2382 3094.5176 3566.8004
redmass: 3.8251 1.2139 2.5636 1.4156 1.1785 1.4226 2.4488 2.8355 2.8091 3.6498 2.2404 2.3281 2.3446 1.5181 2.1265 2.4404 3.0279 3.4119 3.6558 3.6189 3.3691 3.2513 2.4905 1.9169 2.5070 2.2999 3.6184 2.3321 1.6035 1.7109 1.6302 1.9039 1.4307 1.4233 2.0342 1.4817 1.3609 2.1847 1.9893 2.2446 1.7430 1.8252 1.7534 1.7834 1.3538 2.3273 2.1056 1.5504 1.5177 1.7019 2.6250 1.2132 1.2406 1.1987 1.0776 1.0654 1.0514 1.0537 1.0540 1.0601 1.0680 1.0686 1.0621 9.5339 1.0370 1.0373 1.0361 1.0597 1.0612 1.0629 1.1022 1.0964 1.0990 1.0957 1.0974 1.1022 1.1006 1.0984 1.0981 1.0965 1.0674
irintensity: 0.0351 0.1516 0.0546 0.0817 0.1497 0.0998 0.1680 0.1503 0.5112 4.9554 5.4307 22.2296 12.3231 82.8603 0.9452 18.3576 3.0377 3.4743 6.6965 0.0954 4.5466 1.8333 3.0039 56.2990 30.5129 3.0150 78.7395 0.7466 1.1901 6.1800 1.4210 3.7069 0.6371 2.0810 0.6880 10.5964 2.2539 8.3257 6.6017 1.1961 6.0169 5.4813 2.9453 3.5756 23.9448 0.0463 6.9020 20.4219 0.8525 5.9687 19.1853 15.0717 16.1091 25.0943 12.8274 6.5251 16.3289 11.5054 4.8862 2.4036 3.4999 15.0260 4.8884 3.8513 20.3188 40.3264 33.4205 34.7031 5.8439 53.4704 8.7965 18.7636 5.9405 15.0805 74.1645 16.5496 57.5228 20.8441 50.8081 32.3250 32.6867
temp: 298.150 k
press: 1.00000 atm
elementType: 8 7 6 6 6 6 6 6 6 6 6 6 1 1 1 1 1 1 1 1 1 1 1 1 1 1 1 1 1
symmnumber: 1
zpe: 660304.8 jmol-1
zpe.correction: 0.251497 hartree
zpe.thermalcorrener: 0.263891 hartree
zpe.thermalcorrenthalpy: 0.264835 hartree
zpe.thermalcorrgfe: 0.214781 hartree
zpe.sumelectzpe: -520.236219 hartree
zpe.sumelectthermal: -520.223825 hartree
zpe.sumelectthermalent: -520.222881 hartree
zpe.sumelectthermalfe: -520.272935 hartree
dipole: 1.2569 -0.3225 0.0706
dipole: 1.2995
quadrupole: -70.4036 -74.1027 -73.6343
quadrupole: -1.1491 0.3322 0.4399
quadrupole: 2.3099 -1.3892 -0.9208 -1.1491 0.3322 0.4399
hfenergy: -520.4877158 hartree
pointgroup: C01 [X(C10H17N1O1)]
dipole: -0.4926628 0.1359201 0.0139402 debye
polarizability: 134.0739224|-2.9609211|106.1582271|1.8129128|2.0531299|100.6687482 unknown
InChI: InChI=1S/C10H17NO/c1-9(2)7-4-5-10(9,3)8(6-7)11-12/h7,12H,4-6H2,1-3H3
charge 0 multiplicity 1
29 atoms
O  3.348037 0.09035 0.419729
N  2.247199 -0.696398 -0.20286
C  -1.198587 -0.138692 0.596005
C  -0.214202 -0.619997 -0.560608
C  -0.711477 1.358469 0.518792
C  -0.583276 0.37973 -1.72263
C  -0.938434 1.718697 -0.982426
C  0.826396 1.227969 0.720897
C  1.111857 -0.078278 -0.014851
C  -2.697061 -0.32915 0.268698
C  -0.923197 -0.821901 1.958411
C  -0.227137 -2.095244 -0.958435
H  -1.199783 2.045777 1.229915
H  -1.443321 -0.016793 -2.292635
H  0.257603 0.490033 -2.428842
H  -0.290382 2.555993 -1.296583
H  -1.982112 2.023441 -1.174678
H  1.125687 1.146113 1.7820
H  1.401614 2.071075 0.297089
H  -2.952373 -1.404807 0.228273
H  -3.318028 0.126437 1.063371
H  -2.997499 0.123436 -0.690038
H  0.145775 -0.833429 2.230912
H  -1.476924 -0.307732 2.766732
H  -1.268353 -1.872322 1.937394
H  0.048696 -2.743452 -0.107846
H  -1.229057 -2.393266 -1.318406
H  0.501315 -2.290018 -1.765309
H  4.136023 -0.478641 0.223529
