program: Gaussian 09
title: 000076071
version: EM64L-G09RevD.01
frameworkgroup: C1[X(C14H6Cl2O4)]
method: RPBEPBE
basis: SDD
operation: Freq
keyword: #p
keyword: freq=noraman
keyword: PBEPBE/SDD
title: #p freq=noraman PBEPBE/SDD
converged: NO YES NO NO
title: Mulliken charges:
elementType: Cl Cl O O O O C C C C C C C C C C C C C C H H H H H H
charge: 0.032031 0.033155 -0.314180 -0.141761 -0.376723 -0.361695 0.122045 0.188836 0.412474 0.377754 0.005790 -0.192439 0.089540 0.148029 -0.331811 -0.338251 -0.338681 -0.371481 -0.225879 -0.221680 0.269355 0.229369 0.274399 0.274560 0.395796 0.361447
chargesum: 0.00000
title: Mulliken charges with hydrogens summed into heavy atoms:
elementType: Cl Cl O O O O C C C C C C C C C C C C C C
charge: 0.032031 0.033155 -0.314180 -0.141761 0.019073 -0.000248 0.122045 0.188836 0.412474 0.377754 0.005790 -0.192439 0.089540 0.148029 -0.331811 -0.338251 -0.069326 -0.142112 0.048520 0.052880
polarizability: 3.09701930e+02 1.06380065e+00 2.50157833e+02 1.36013377e-02 -9.03811772e-04 6.69743717e+01
1716.lowfreq: -38.5176 -5.7892 -2.1383 -1.9731 -0.0027 -0.0026 -0.0021 19.1097 75.2721
frequency: -38.4937 19.0195 75.2715 78.2553 146.4528 156.0505 169.4101 205.8535 244.6330 248.5132 292.2456 312.3101 326.1310 351.5760 363.6841 400.4444 410.8310 411.0935 421.2047 434.0847 446.3124 464.6092 495.0151 505.9632 520.9491 527.7566 586.8067 620.4297 658.9627 698.9157 728.1637 738.9437 750.6983 757.9909 816.7939 827.7139 831.1456 872.5149 885.7684 941.4353 943.7592 962.3327 984.0170 1054.2873 1097.7048 1131.3917 1159.1190 1172.4295 1184.0404 1241.8619 1258.3917 1266.4149 1289.0635 1338.9244 1342.1446 1367.4404 1417.8823 1422.9929 1425.0502 1460.5647 1528.5491 1543.7140 1561.9135 1571.6774 1586.1155 1629.4256 2615.1583 3120.2878 3166.9824 3183.5006 3185.7892 3529.3228
redmass: 12.2264 11.3337 9.5184 7.1739 8.0481 12.2297 7.2789 18.5445 11.3571 6.3190 6.5664 28.0194 7.7538 5.6787 12.6107 8.6913 1.1574 7.5241 6.1403 9.2062 8.2172 8.9766 5.0333 8.8435 4.8450 5.9383 3.7801 6.6168 5.7631 7.8768 7.2905 9.0544 8.3591 10.1374 1.6293 1.3737 9.9135 8.2885 8.3214 6.4916 1.3401 1.3559 1.0650 3.4673 5.9732 2.2150 1.4060 1.5109 1.7836 1.9583 2.7330 3.5855 4.5557 4.9306 4.8638 5.4460 4.1086 5.8089 5.1160 2.5095 6.3788 7.0871 7.0181 7.7228 3.2184 7.0448 1.0717 1.0903 1.0891 1.0953 1.0983 1.0657
irintensity: 5.8964 1.3086 0.9883 0.6379 0.7257 1.6579 0.6399 0.9593 0.0103 0.4939 0.1767 1.5486 9.1432 0.0127 3.9780 4.5362 118.1132 7.2331 0.4033 9.6731 6.3649 11.2987 0.0438 2.7720 27.5932 12.1440 8.5749 13.6872 0.5085 18.3783 0.0374 59.6877 1.2790 1.6006 53.2877 41.0642 2.3752 44.5530 24.1098 34.2889 3.9543 0.0642 127.0235 50.6989 78.8886 27.3087 26.1725 3.1023 70.6153 133.4612 501.3182 135.6228 94.5544 62.1638 11.7199 29.4667 99.0002 94.2962 128.4160 97.0560 55.5976 97.3974 32.3751 59.4295 69.8509 4.3833 124.6742 13.9077 0.0106 3.0167 1.4733 47.8807
temp: 298.150 k
press: 1.00000 atm
elementType: 17 17 8 8 8 8 6 6 6 6 6 6 6 6 6 6 6 6 6 6 1 1 1 1 1 1
symmnumber: 1
zpe: 427582.4 jmol-1
zpe.correction: 0.162858 hartree
zpe.thermalcorrener: 0.178072 hartree
zpe.thermalcorrenthalpy: 0.179016 hartree
zpe.thermalcorrgfe: 0.119641 hartree
zpe.sumelectzpe: -1756.733992 hartree
zpe.sumelectthermal: -1756.718777 hartree
zpe.sumelectthermalent: -1756.717833 hartree
zpe.sumelectthermalfe: -1756.777209 hartree
dipole: 1.5135 0.7559 0.0044
dipole: 1.6917
quadrupole: -89.1551 -145.8732 -128.4101
quadrupole: 11.6566 0.0020 -0.0190
quadrupole: 31.9911 -24.7271 -7.2640 11.6566 0.0020 -0.0190
hfenergy: -1756.8968494 hartree
pointgroup: C01 [X(C14H6Cl2O4)]
dipole: -0.5907295 0.306641 -0.0018195 debye
dipolederiv: -0.1037859 0.1510366 -0.0000391 0.3449946 -0.7212706 0.0002612 -0.0002344 0.0000719 -0.0159555 -0.1001201 -0.1709296 0.0001662 -0.3435905 -0.6762895 0.0003609 0.0000341 0.0002797 -0.0159214 -0.5625305 -0.0998564 0.0000622 0.2363889 -0.8951429 0.001273 -0.0000719 -0.0000223 -0.3134646 -0.5252003 -0.0001742 0.0000814 -0.1853814 -0.66062 -0.0011485 0.0004446 0.0011574 -0.2653576 -0.3692238 0.0034428 -0.0003606 -0.5707681 -1.1616784 -0.0006302 -0.0002776 -0.0005198 -0.3721098 -0.0806366 0.1696738 0.0001991 0.8570878 -1.2093622 0.0002222 0.0002238 0.0000881 -0.3571716 -1.0223657 0.0624928 -0.0005657 0.5222617 -0.171553 0.000086 -0.0015489 0.0000573 -0.0282022 -0.7059029 -0.022322 0.0000084 -0.5692646 -0.0969589 0.0001147 -0.0001505 -0.000045 0.0203963 -0.5269961 -0.1667539 0.0004865 -0.2961578 -0.2528019 0.0003934 0.0008467 -0.00001 0.0306078 -0.3975474 0.1032787 0.00004 0.3168511 -0.2578883 0.0002757 0.0005566 -0.0000802 0.069714 1.7478666 -0.0289092 0.0001156 -0.2327431 0.7883023 -0.0015787 -0.0001286 -0.0005417 0.14827 1.6004347 0.0000144 -0.0002162 0.1290972 0.6688777 0.0004021 -0.0006202 -0.000407 0.1273629 -0.1256854 -0.2700905 0.0000204 0.5802906 1.0411915 0.0009569 -0.0003941 0.000869 0.100687 -0.3327534 -0.0457861 -0.0002336 -0.8095681 1.1166938 -0.0002666 -0.0003178 -0.0002455 0.0698452 -0.0481 0.0341697 -0.0001836 -0.5516164 1.1093278 -0.0004255 0.0006711 -0.0003908 -0.0608781 -0.2107695 0.1011324 -0.0001353 0.5895381 1.0990225 -0.0005866 0.0003529 -0.0005551 -0.0701288 0.4153984 0.2939923 0.0004809 -0.4158831 -0.1646221 -0.0001939 0.0004004 -0.0000914 -0.1342211 0.4483621 -0.2181317 0.0003745 0.5194973 -0.1261512 0.0001706 0.0005581 -0.0001307 -0.1434815 0.2144081 -0.1082196 -0.0001402 0.1690497 -0.2832632 0.0001766 -0.0004838 0.0002179 -0.0870778 0.2270764 0.047977 -0.0002511 -0.2461542 -0.1846279 -0.0000789 -0.0002515 -0.0000787 -0.0796536 0.0160502 -0.0385613 -0.0001332 -0.0757869 0.0633807 -0.000086 -0.0003127 -0.000173 0.1659643 -0.0329236 0.0690431 -0.0001336 0.1447939 0.0036538 0.0001274 -0.0001 0.0002097 0.1609587 0.0167623 0.0356885 0.0001162 0.066389 0.0545894 -0.0000236 0.0001361 -0.0000387 0.1608796 0.014782 -0.0337052 0.0001564 -0.0664271 0.058845 0.000131 0.0001891 0.0001918 0.1585454 0.3545583 0.1067417 0.0003159 0.0547983 0.4360441 0.0001141 0.0006444 0.0001916 0.357569 0.0888422 0.0247558 -0.0002314 -0.1676969 0.4223016 -0.0000471 -0.000166 -0.0000045 0.3728236 unknown
polarizability: 309.6542431|-1.9922164|250.2054929|0.0007929|-0.071402|66.9743987 unknown
InChI: InChI=1S/C14H6Cl2O4/c15-5-1-2-6(16)10-9(5)13(19)11-7(17)3-4-8(18)12(11)14(10)20/h1-4,17-18H
charge 0 multiplicity 1
26 atoms
Cl 2.683015 -3.222717 0.001903
Cl 2.76707 3.190743 -0.001201
O  -0.084087 -2.728169 0.003463
O  -0.008829 2.780651 -0.001508
O  -2.554737 -2.792261 -0.000287
O  -2.629411 2.811737 0.00043
C  -1.291908 -0.677687 0.002187
C  -1.305146 0.757908 0.001945
C  1.267547 -0.718709 0.002215
C  1.2759 0.72999 0.001584
C  -0.036469 -1.430865 0.003789
C  -0.024555 1.513939 0.003131
C  -2.521249 -1.424791 0.000813
C  -2.56424 1.421625 0.000676
C  2.509228 -1.417316 0.001269
C  2.535288 1.391048 -0.000177
C  -3.761863 -0.731132 -0.000078
C  -3.77488 0.662536 -0.00013
C  3.73791 -0.728821 -0.00042
C  3.749497 0.672578 -0.001176
H  -4.684774 -1.316456 -0.001077
H  -4.7366 1.192111 -0.001014
H  4.675393 -1.290497 -0.001182
H  4.697834 1.216251 -0.002502
H  -1.555815 -3.10639 -0.001408
H  -3.575617 3.111497 -0.000343
