program: Gaussian 09
title: 000076018
version: EM64L-G09RevD.01
frameworkgroup: C1[X(C4H2Cl2N2O)]
method: RPBEPBE
basis: SDD
operation: Freq
keyword: #p
keyword: freq=noraman
keyword: PBEPBE/SDD
title: #p freq=noraman PBEPBE/SDD
converged: NO NO NO NO
title: Mulliken charges:
elementType: Cl Cl O N N C C C C H H
charge: 0.012569 0.059327 -0.203819 -0.370594 0.090833 -0.204256 0.001714 0.299872 -0.341940 0.290066 0.366230
chargesum: 0.00000
title: Mulliken charges with hydrogens summed into heavy atoms:
elementType: Cl Cl O N N C C C C
charge: 0.012569 0.059327 -0.203819 -0.004364 0.090833 0.085809 0.001714 0.299872 -0.341940
polarizability: 1.35185045e+02 -9.31741592e+00 7.68145396e+01 2.15214833e-04 6.83249887e-03 2.98000731e+01
1716.lowfreq: -6.8950 0.0028 0.0029 0.0033 12.8361 14.2236 79.3870 155.4559 196.9732
frequency: 79.3848 155.4486 196.9724 249.2835 308.1066 310.7380 429.6944 435.7137 540.5353 559.4962 566.9634 619.2830 646.2813 728.0984 843.9332 902.7079 1029.5861 1044.6372 1121.2773 1232.4855 1313.5220 1435.8767 1513.2587 1570.3011 1602.8304 3201.8497 3573.3054
redmass: 12.0615 6.9447 17.1744 13.5860 8.7957 27.0159 6.3606 10.9300 9.5460 8.1976 8.8920 1.2341 9.1244 3.2696 1.5823 10.7333 6.2223 3.1755 5.3714 2.7122 2.2912 2.7164 3.0214 6.8124 7.6048 1.0941 1.0802
irintensity: 0.0290 1.9494 0.5724 4.5252 1.1877 3.8180 0.2807 7.4323 5.2031 64.6706 1.8671 98.0867 9.8828 10.6219 50.7283 10.4026 105.9509 3.3061 152.8000 2.7338 53.8627 46.6064 56.3486 12.0749 374.4850 3.9873 133.6848
temp: 298.150 k
press: 1.00000 atm
elementType: 17 17 8 7 7 6 6 6 6 1 1
symmnumber: 1
zpe: 156780.0 jmol-1
zpe.correction: 0.059714 hartree
zpe.thermalcorrener: 0.067580 hartree
zpe.thermalcorrenthalpy: 0.068524 hartree
zpe.thermalcorrgfe: 0.025979 hartree
zpe.sumelectzpe: -1257.779614 hartree
zpe.sumelectthermal: -1257.771749 hartree
zpe.sumelectthermalent: -1257.770805 hartree
zpe.sumelectthermalfe: -1257.813350 hartree
dipole: 4.3146 -2.8132 0.0000
dipole: 5.1507
quadrupole: -67.7490 -67.4246 -64.8871
quadrupole: 1.4244 -0.0006 -0.0004
quadrupole: -1.0621 -0.7377 1.7998 1.4244 -0.0006 -0.0004
hfenergy: -1257.8393288 hartree
pointgroup: C01 [X(C4H2Cl2N2O1)]
dipole: 1.7743702 0.9788486 -0.0000085 debye
dipolederiv: -1.012042 0.0171074 0.0000282 0.010597 -0.1248815 -0.0000205 0.00001 -0.0000403 -0.0046982 -0.7818712 0.1812651 -0.0000169 0.2245244 -0.089537 -0.0000011 -0.0001476 0.0000196 -0.0250837 -0.7176726 -0.3839399 -0.0001274 -0.4347026 -0.7956796 -0.0001459 0.000011 0.0000389 -0.3387448 -0.8512224 -0.082744 0.000009 0.090774 -0.6253853 -0.0000874 0.0000933 0.0000156 -0.2024048 0.2210215 0.226707 -0.000086 -0.1573743 -0.1875298 -0.0000903 -0.0001955 -0.0000077 -0.0798655 -0.8188642 -0.5031494 -0.0001017 0.0180135 -0.2520594 -0.0000154 0.0000168 -0.0000055 -0.1659673 1.5437006 0.0614979 0.0000052 0.0752321 0.9885523 0.0001934 0.0000066 0.0001269 0.0382388 0.772509 0.6403532 0.0001717 0.3508619 0.8787294 0.0001752 -0.0000235 0.0000729 0.2550839 1.3835359 -0.2395651 0.0000985 -0.3036986 -0.1667913 0.0000375 0.0002106 -0.0001686 -0.0086702 0.0727175 0.0273709 -0.0000029 0.0321941 0.0719297 -0.0000278 -0.0000157 -0.0000177 0.1848104 0.1881878 0.0550969 0.0000223 0.0935784 0.3026525 -0.0000177 0.000034 -0.0000341 0.3473014 unknown
polarizability: 136.2367197|4.9316775|75.762865|0.0002883|0.0068298|29.8000731 unknown
InChI: InChI=1S/C4H2Cl2N2O/c5-3-1-2(9)4(6)8-7-3/h1,7H
charge 0 multiplicity 1
11 atoms
Cl 3.360732 -0.120847 -0.000164
Cl -2.885902 0.847895 -0.000018
O  -1.561156 -1.931743 -0.000269
N  1.038492 1.248919 0.000106
N  -0.313213 1.515592 0.000297
C  0.727607 -1.136819 -0.000282
C  1.551307 -0.035535 -0.000119
C  -0.734459 -0.972868 -0.000342
C  -1.131325 0.474419 0.000213
H  1.129823 -2.151627 -0.000447
H  1.637794 2.075113 0.000224
