program: Gaussian 09
title: 000076009
version: EM64L-G09RevD.01
frameworkgroup: C1[X(C9H9N)]
method: RPBEPBE
basis: SDD
operation: Freq
keyword: #p
keyword: freq=noraman
keyword: PBEPBE/SDD
title: #p freq=noraman PBEPBE/SDD
converged: NO NO NO NO
title: Mulliken charges:
elementType: N C C C C C C C C C H H H H H H H H H
charge: -0.078961 0.360892 0.360889 0.067138 -0.406726 -0.406719 -0.221480 -0.797583 -0.797578 -0.225540 0.242018 0.242014 0.231070 0.244620 0.244629 0.226032 0.244635 0.244616 0.226032
chargesum: 0.00000
title: Mulliken charges with hydrogens summed into heavy atoms:
elementType: N C C C C C C C C C
charge: -0.078961 0.360892 0.360889 0.067138 -0.164708 -0.164705 0.009590 -0.082301 -0.082295 -0.225540
polarizability: 1.40059959e+02 -4.13494102e-03 1.12518704e+02 -2.36366341e-03 -9.46450545e-04 5.18236450e+01
1716.lowfreq: -6.2898 -5.3340 -0.0006 -0.0006 -0.0004 13.2010 110.4244 118.5333 122.0571
frequency: 110.4153 118.5332 122.0533 141.1304 210.2495 225.3703 272.5902 370.7654 393.7171 453.8919 496.2677 516.0910 571.6983 575.0540 626.6899 746.1861 784.0607 791.8572 900.8016 921.1488 981.2749 987.4685 1045.4021 1046.5899 1046.6136 1087.3286 1175.8659 1180.0056 1262.4136 1273.3784 1366.6223 1403.6101 1403.8087 1426.4064 1453.0625 1465.0588 1465.4975 1480.0734 1483.7132 1593.1109 1603.8620 2043.0047 2980.8762 2981.2851 3058.9567 3059.0235 3093.2891 3093.6463 3128.8671 3140.6488 3161.4196
redmass: 3.6463 1.0310 1.0572 6.9809 4.2994 2.8920 2.7255 3.5964 5.0936 6.3184 4.6021 3.0951 3.9959 5.9361 4.8294 4.3952 1.2007 5.4347 1.3076 2.5457 1.3422 1.6136 1.8344 1.5224 1.5614 1.8660 4.2416 1.1669 1.5778 3.2222 6.9290 1.2501 1.2167 2.4069 1.6711 1.0445 1.0442 1.2455 1.4171 7.7716 5.7041 13.0156 1.0374 1.0374 1.0972 1.0972 1.0993 1.0992 1.0860 1.0923 1.0996
irintensity: 4.6923 0.0001 0.5017 4.7047 1.4364 0.0000 1.5032 0.6045 6.8934 0.2389 1.2309 0.0000 0.6212 0.0769 0.0728 1.9892 61.9071 1.0807 0.0000 5.0652 0.2077 2.0668 0.4538 0.0358 15.4513 11.7318 0.9061 1.7807 0.0470 0.0056 4.9636 19.1796 10.7232 0.1707 0.0555 31.7067 0.0026 23.7382 26.0393 6.9491 2.3672 101.2051 29.0399 5.0797 0.3074 26.5588 19.7891 17.3724 0.1805 19.6712 24.8514
temp: 298.150 k
press: 1.00000 atm
elementType: 7 6 6 6 6 6 6 6 6 6 1 1 1 1 1 1 1 1 1
symmnumber: 1
zpe: 396686.2 jmol-1
zpe.correction: 0.151090 hartree
zpe.thermalcorrener: 0.160749 hartree
zpe.thermalcorrenthalpy: 0.161693 hartree
zpe.thermalcorrgfe: 0.116551 hartree
zpe.sumelectzpe: -402.365226 hartree
zpe.sumelectthermal: -402.355567 hartree
zpe.sumelectthermalent: -402.354623 hartree
zpe.sumelectthermalfe: -402.399765 hartree
dipole: 3.6974 -0.0006 0.0002
dipole: 3.6974
quadrupole: -69.2152 -49.9392 -61.5315
quadrupole: 0.0031 0.0005 -0.0002
quadrupole: -8.9866 10.2894 -1.3028 0.0031 0.0005 -0.0002
hfenergy: -402.516316 hartree
pointgroup: C01 [X(C9H9N1)]
dipole: -1.4546571 -0.0006781 -0.0005833 debye
dipolederiv: -0.9846081 -0.0003827 -0.0002408 -0.000379 -0.1391314 -0.0000087 -0.0001875 -0.0000074 0.0138718 0.078025 0.2091601 0.000047 0.0511049 0.2387869 0.0000382 0.0000027 0.0000137 -0.003283 0.0782619 -0.2093073 -0.0000093 -0.0512461 0.2385456 0.0000363 -0.000063 0.000179 -0.0032823 0.3662802 0.0001663 0.0000879 0.0001542 0.0153763 0.0000056 0.0001025 -0.0000193 0.0429938 -0.1238917 -0.2197185 0.0000253 -0.113964 -0.0653764 -0.0000622 0.0000219 -0.0000922 -0.1903882 -0.1242069 0.2196647 0.0000503 0.1139162 -0.0650699 0.0000455 0.0000294 0.0000732 -0.19039 0.1102327 0.0000136 0.0000798 0.0000132 0.0909918 0.0000093 0.0001209 -0.0000017 -0.1194023 -0.0178914 -0.1786304 -0.0000493 -0.1029746 -0.0539546 -0.000029 -0.0000294 0.0000374 0.0520208 -0.0181458 0.1786599 -0.00004 0.1030024 -0.0536997 -0.0000346 0.0000307 -0.000338 0.0520216 0.5895488 0.0003636 0.0001618 0.0003651 -0.216583 0.0000063 0.0001478 0.0000075 -0.2452093 0.0386706 0.0612444 -0.000047 0.097969 -0.0741733 0.0000276 -0.0000454 0.0000089 0.1575171 0.038816 -0.0611402 -0.0000551 -0.0978676 -0.0743288 -0.000024 -0.0000371 0.0000094 0.1575147 -0.1251107 -0.0000988 -0.0001104 -0.0001048 0.0830062 0.0000022 -0.0001127 0.0000041 0.1575787 0.0292681 -0.0464003 -0.1024715 -0.0164177 0.0472609 0.0221219 -0.099756 -0.0323817 -0.0264183 0.0292402 -0.0464803 0.1024593 -0.0164811 0.047218 -0.0220455 0.0997687 0.0324057 -0.0264008 -0.0115455 0.164509 0.0000401 0.0649283 -0.0566314 -0.0000458 -0.000002 -0.0000347 0.1120374 0.0293586 0.0465049 0.1023721 0.0165448 0.0472268 0.0220615 0.0997493 -0.0323602 -0.0265984 0.0290363 0.0463423 -0.1025151 0.0163226 0.0473687 -0.022289 -0.0998324 0.0322463 -0.0262188 -0.0113384 -0.1644705 0.0002147 -0.0648859 -0.0568327 0.0001844 0.0000914 0.0002502 0.1120357 unknown
polarizability: 140.0599447|0.012452|112.5187089|0.0288919|0.0030825|51.8236546 unknown
InChI: InChI=1S/C9H9N/c1-7-5-4-6-8(2)9(7)10-3/h4-6H,1-2H3
charge 0 multiplicity 1
19 atoms
N  1.802215 0.000865 0.000954
C  -0.281565 1.250651 0.000231
C  -0.280387 -1.250857 0.000155
C  0.404539 0.000218 0.000397
C  -1.69545 1.224629 -0.000315
C  -1.694298 -1.226138 -0.00034
C  -2.39924 -0.001087 -0.000614
C  0.488961 2.556077 0.000594
C  0.491331 -2.555581 0.000392
C  3.009005 0.001412 0.001254
H  -2.24546 2.172181 -0.000495
H  -2.243419 -2.174206 -0.000502
H  -3.494782 -0.00162 -0.00105
H  1.144595 2.637456 0.887699
H  1.144655 2.637975 -0.886426
H  -0.198435 3.418589 0.000805
H  1.146236 -2.637249 -0.887235
H  1.147892 -2.636007 0.886892
H  -0.195291 -3.418707 0.001604
