program: Gaussian 09
title: 000076004
version: EM64L-G09RevD.01
frameworkgroup: C1[X(C5H12O3Si)]
method: RPBEPBE
basis: SDD
operation: Freq
keyword: #p
keyword: freq=noraman
keyword: PBEPBE/SDD
title: #p freq=noraman PBEPBE/SDD
converged: YES YES NO NO
title: Mulliken charges:
elementType: Si O O O C C C C C H H H H H H H H H H H H
charge: 1.530380 -0.602996 -0.571133 -0.571786 -0.560362 -0.475661 -0.486795 -0.486888 -0.474453 0.246023 0.219620 0.227141 0.219201 0.213765 0.235711 0.214942 0.235770 0.213435 0.215088 0.223915 0.235084
chargesum: 0.00000
title: Mulliken charges with hydrogens summed into heavy atoms:
elementType: Si O O O C C C C C
charge: 1.530380 -0.602996 -0.571133 -0.571786 -0.314338 0.190301 0.177622 0.177405 -0.015454
polarizability: 8.87353272e+01 9.05699628e+00 9.25207991e+01 -8.17974945e-01 -9.05487612e-01 7.11457266e+01
1716.lowfreq: -42.8563 -21.8635 -15.7287 -8.7150 -0.0011 0.0004 0.0009 23.2769 38.1829
frequency: -41.8385 15.3572 37.5994 60.9820 65.1451 81.9220 92.6142 95.7537 126.6642 147.7328 171.8873 237.3648 287.3938 323.9121 326.8916 405.5217 521.9068 539.0240 710.6345 733.3930 742.0602 984.8901 1015.8200 1017.0895 1047.7017 1052.1356 1067.7889 1119.8123 1120.8191 1124.6936 1143.9549 1144.8112 1148.4862 1264.2247 1419.8275 1442.0310 1444.4230 1447.9611 1468.6098 1470.5598 1471.5577 1472.0813 1473.6148 1475.0050 1609.9530 2947.6273 2949.3266 2959.7022 3031.6016 3032.1582 3046.8133 3074.3683 3090.9551 3091.1599 3093.7497 3113.1653 3177.6953
redmass: 1.8155 1.3853 2.5800 2.8402 2.7982 1.2153 1.2328 1.8879 3.2898 2.4928 4.0625 3.9595 5.1787 4.8452 4.2065 5.5563 1.9137 5.3989 8.7360 8.9354 5.9597 1.3587 1.0824 1.2265 5.5376 6.3005 5.0544 1.2493 1.2560 1.2501 1.4151 1.4190 1.4657 1.3240 1.2504 1.1230 1.1215 1.1180 1.0510 1.0515 1.0521 1.0510 1.0504 1.0532 3.7906 1.0322 1.0325 1.0312 1.1035 1.1035 1.1037 1.0593 1.0998 1.0997 1.1016 1.0923 1.1147
irintensity: 0.3792 0.0977 0.0806 7.8320 4.4420 1.3496 1.2413 0.5176 11.9474 8.3982 22.5813 10.2446 2.8575 13.9770 8.2192 43.3642 33.1350 7.6350 108.4265 100.8836 130.0667 29.0924 15.5034 8.8467 497.9338 245.0338 14.0557 0.1884 0.3596 1.1120 72.0488 32.0320 3.0943 2.2003 21.5504 0.6618 0.2309 1.0361 12.2789 16.9083 3.2350 5.5458 9.7270 0.4119 2.6807 156.5022 12.5232 76.5587 1.4984 103.0396 52.1501 12.5769 14.0943 58.8364 33.1235 4.6481 20.3116
temp: 298.150 k
press: 1.00000 atm
elementType: 14 8 8 8 6 6 6 6 6 1 1 1 1 1 1 1 1 1 1 1 1
symmnumber: 1
zpe: 435320.7 jmol-1
zpe.correction: 0.165805 hartree
zpe.thermalcorrener: 0.179360 hartree
zpe.thermalcorrenthalpy: 0.180304 hartree
zpe.thermalcorrgfe: 0.122835 hartree
zpe.sumelectzpe: -712.064504 hartree
zpe.sumelectthermal: -712.050949 hartree
zpe.sumelectthermalent: -712.050004 hartree
zpe.sumelectthermalfe: -712.107473 hartree
dipole: 0.3059 0.3764 1.5980
dipole: 1.6700
quadrupole: -52.9476 -53.0368 -68.5339
quadrupole: -0.0907 0.4425 0.5988
quadrupole: 5.2252 5.1360 -10.3611 -0.0907 0.4425 0.5988
hfenergy: -712.2303087 hartree
pointgroup: C01 [X(C5H12O3Si1)]
dipole: 0.2243934 -0.0301259 -0.6167896 debye
dipolederiv: 2.2040951 0.0139177 0.0764265 0.0136801 2.2904289 -0.011486 0.1558851 -0.0249408 1.4967941 -1.6259235 0.1277612 -0.1826535 0.1224382 -0.7380264 0.0266762 -0.2169699 0.0326578 -0.6469971 -0.712391 -0.0814581 0.0301328 -0.0749905 -1.5482793 0.1528027 0.0359811 0.2372973 -0.6061742 -0.7340106 -0.1501781 -0.012234 -0.1564344 -1.5282277 -0.1557108 -0.0299135 -0.2376766 -0.6080307 -0.448279 -0.0196209 -0.0227715 -0.0201113 -0.5881129 0.0056785 -0.0354608 0.0067938 -0.1550044 0.9401217 -0.0895215 0.1167332 -0.0866961 0.3304235 -0.0156053 -0.1061458 0.0151336 0.2297341 0.302098 0.001062 0.0136009 0.0905978 0.983059 -0.1005967 0.0301147 0.1445796 0.213696 0.3286674 0.1827735 0.0394055 0.0954368 0.9567504 0.0924272 -0.0103214 -0.1473742 0.2141759 0.024204 -0.0451737 -0.0555398 -0.0445999 -0.3049485 0.0109664 0.0849274 -0.0076404 0.1296589 0.0586529 0.0169453 0.0231714 0.0166965 0.1807709 -0.0053591 0.0219109 -0.0052387 -0.0993357 -0.0642479 -0.0343125 0.0310421 -0.0982556 -0.0603441 0.1005503 0.1184504 0.1023926 0.0195523 -0.0711273 0.018799 -0.1077565 0.0147101 0.1029747 0.0016181 -0.1456791 0.0077574 -0.0938801 -0.0331399 0.0294108 0.0013213 0.0988389 -0.1224695 -0.0923919 0.0797213 -0.1182739 0.0422326 -0.0731892 -0.0911212 -0.113853 -0.0451977 -0.0512778 -0.0220086 -0.1368624 -0.1167313 -0.0051242 0.1002253 -0.0241895 0.0219092 -0.0237119 -0.0660453 0.1113034 0.0273169 0.1393298 -0.0765205 -0.1138846 0.1128953 0.0841478 0.040507 -0.0396925 -0.0215628 0.0827748 -0.103626 0.0458415 0.1006489 -0.0223448 -0.0085109 -0.0230029 -0.0665254 -0.1131188 -0.0110859 -0.1413933 -0.0762358 -0.035817 0.0869612 -0.1039446 0.0403192 -0.0886988 0.0524185 -0.1003433 0.1495459 -0.005672 -0.149062 -0.0823578 0.0867757 -0.0099469 -0.0052333 -0.0020521 0.1075051 0.0774004 0.0461024 -0.0886137 0.0416932 0.0966463 0.041855 0.2117143 -0.0144841 0.0924274 -0.0139924 0.0179204 0.0909723 0.0080589 -0.014049 0.0078677 0.1517595 -0.0000651 -0.0442329 0.0039995 -0.0827335 unknown
polarizability: 99.3345075|-2.373206|81.6891106|2.8314067|-0.3176526|71.3782348 unknown
InChI: InChI=1S/C5H12O3Si/c1-5-9(6-2,7-3)8-4/h5H,1H2,2-4H3
charge 0 multiplicity 1
21 atoms
Si -0.068847 0.007845 -0.035796
O  -1.341562 0.182466 -1.181559
O  -0.361557 -1.28574 1.057031
O  0.006293 1.332709 1.055557
C  1.453416 -0.204428 -1.116866
C  -2.75517 0.379455 -0.870657
C  -0.340722 -2.703489 0.713097
C  0.410244 2.691601 0.711356
C  2.713895 -0.368997 -0.630587
H  1.295762 -0.191837 -2.204622
H  -3.147752 -0.442722 -0.241219
H  -3.295046 0.394552 -1.831436
H  -2.918692 1.338963 -0.34284
H  -1.177294 -2.971092 0.037325
H  -0.451381 -3.257534 1.659334
H  0.614782 -2.99542 0.232211
H  0.451571 3.25582 1.657145
H  -0.321292 3.174941 0.033546
H  1.410041 2.71394 0.232399
H  3.579436 -0.490026 -1.295587
H  2.926074 -0.389406 0.446567
