program: Gaussian 09
title: 000075992
version: EM64L-G09RevD.01
frameworkgroup: C1[X(C6H6N2O4)]
method: RPBEPBE
basis: SDD
operation: Freq
keyword: #pfreq=noraman
keyword: PBEPBE/SDD
title: #p freq=noraman PBEPBE/SDD
converged: NO NO NO NO
title: Mulliken charges:
elementType: O O O O N N C C C C C C H H H H H H
charge: -0.216120 -0.174510 -0.174619 -0.074025 -0.193956 -0.194026 0.271927 0.155423 0.155375 0.043147 -0.594090 -0.594066 0.271255 0.261760 0.261751 0.261761 0.271258 0.261755
chargesum: 0.00000
title: Mulliken charges with hydrogens summed into heavy atoms:
elementType: O O O O N N C C C C C C
charge: -0.216120 -0.174510 -0.174619 -0.074025 -0.193956 -0.194026 0.271927 0.155423 0.155375 0.043147 0.200676 0.200708
polarizability: 1.04002443e+02 -7.48796524e-04 1.20813792e+02 6.54768229e-03 -2.63605245e-02 4.62281412e+01
1716.lowfreq: -10.2853 -0.0004 0.0004 0.0005 5.3197 9.5114 41.2097 62.3912 86.3012
frequency: 40.7290 62.3793 86.2879 87.5638 117.7500 195.4566 294.0264 305.5759 324.8978 362.5512 370.1656 380.1056 416.2443 421.8647 428.7396 521.8603 589.1746 647.8226 709.9974 758.9472 803.2621 923.2084 935.4196 1018.9430 1082.0258 1121.0786 1128.7492 1130.6153 1213.8861 1264.4009 1317.6396 1324.2775 1428.2606 1436.4273 1473.8648 1474.4520 1476.2517 1477.9849 1595.2138 1598.3376 1625.6693 1652.6744 3018.4090 3018.6657 3111.6210 3112.1631 3147.6170 3147.7926
redmass: 14.4994 3.3339 1.1093 1.1445 3.8540 5.2202 4.9570 3.0526 6.8776 4.3743 10.9298 8.7357 9.3748 9.1410 13.2035 7.6814 10.4999 10.0606 10.2174 5.4071 12.0344 3.2763 6.4125 3.9859 2.8396 3.1273 1.3089 1.3132 4.5509 3.6411 4.8625 6.8959 1.1707 1.2431 1.0429 1.0422 1.0593 1.1022 10.5898 10.9194 12.2314 10.4837 1.0334 1.0334 1.1025 1.1026 1.1023 1.1024
irintensity: 0.0770 0.0000 1.4753 0.1072 10.0077 1.6178 0.0003 1.1413 5.7923 5.0340 23.1617 29.1101 23.4666 6.7476 0.0287 0.0201 0.0000 1.1411 16.3794 0.0185 2.3131 4.2851 1.6741 4.3139 63.6534 164.1490 0.0015 0.1460 26.8382 103.4507 94.0505 220.1481 14.2310 163.0663 0.8176 40.6779 22.9282 7.7950 639.1146 113.6320 9.1440 0.3054 12.7476 12.4534 5.8879 15.8392 0.8239 0.7204
temp: 298.150 k
press: 1.00000 atm
elementType: 8 8 8 8 7 7 6 6 6 6 6 6 1 1 1 1 1 1
symmnumber: 1
zpe: 324074.6 jmol-1
zpe.correction: 0.123434 hartree
zpe.thermalcorrener: 0.134939 hartree
zpe.thermalcorrenthalpy: 0.135883 hartree
zpe.thermalcorrgfe: 0.084947 hartree
zpe.sumelectzpe: -641.758368 hartree
zpe.sumelectthermal: -641.746863 hartree
zpe.sumelectthermalent: -641.745918 hartree
zpe.sumelectthermalfe: -641.796855 hartree
dipole: 0.0024 -4.3853 -0.0025
dipole: 4.3853
quadrupole: -69.7754 -86.3309 -64.8804
quadrupole: 0.0017 -0.0041 0.0146
quadrupole: 3.8868 -12.6686 8.7818 0.0017 -0.0041 0.0146
hfenergy: -641.8818018 hartree
pointgroup: C01 [X(C6H6N2O4)]
dipole: 0.0311155 -1.7250127 0.0011424 debye
dipolederiv: -0.5867451 0.0091204 0.0000557 0.0089668 -1.0719244 -0.0011267 0.0000702 -0.0008628 -0.3305836 -0.806146 0.4380657 0.0005928 0.1608873 -0.6431001 -0.0002621 0.0007211 -0.0003993 -0.3045681 -0.7835311 -0.4431574 -0.0005847 -0.1660485 -0.665496 -0.0003204 -0.0005637 -0.0004333 -0.3046449 -0.3850609 0.0048978 0.0000132 0.004957 -0.648234 0.000876 -0.000001 0.0008244 -0.2406652 -1.054492 0.2356623 0.0004315 0.6363087 -1.0948717 -0.000911 0.0011519 0.0004454 -0.1942821 -1.0217118 -0.2330296 -0.0001884 -0.6335796 -1.1270699 -0.0008106 -0.0006608 0.000274 -0.1943075 1.9423447 0.0097159 -0.0003125 0.0097755 1.4163748 0.0023168 -0.0004045 0.0019398 0.3076414 0.5699199 -0.4825212 -0.0007082 -0.5546373 1.2246221 0.0006221 -0.000633 0.0006046 0.2399359 0.5320925 0.4566314 0.0008635 0.5288094 1.2617923 0.00081 0.0006642 0.000747 0.2398569 0.6306365 -0.0033215 -0.0000187 -0.0033764 0.8120007 -0.0013113 -0.000019 -0.0014261 0.2306436 0.2599821 0.1861649 0.0005462 0.1386953 0.1041497 0.0003157 0.0008876 -0.0007401 0.1871241 0.2716764 -0.1799014 -0.0004695 -0.1324261 0.0924381 0.0002519 -0.0007539 -0.0006229 0.1870999 0.0440329 0.0085507 0.0006595 0.1337586 0.09351 -0.0013305 0.0004882 -0.0006013 0.1343105 0.0860576 -0.007535 -0.0449726 -0.0594002 0.0376584 0.0764293 0.0043735 0.0728092 -0.0216581 0.0853651 -0.0093267 0.0436252 -0.0599465 0.0386069 -0.0753972 -0.006259 -0.0724598 -0.0242868 0.0834178 0.009481 0.0418776 0.0611938 0.0402912 0.0778446 -0.0073143 0.0725327 -0.021996 0.0492778 -0.0102406 -0.0003977 -0.1354176 0.0881127 -0.0009364 -0.0003613 -0.0004516 0.1343211 0.0828835 0.0107432 -0.041013 0.0614798 0.0411392 -0.0770601 0.0086138 -0.0721799 -0.023941 unknown
polarizability: 104.0082155|-0.3114611|120.8080242|-0.0064523|0.018947|46.2281366 unknown
InChI: InChI=1S/C6H6N2O4/c1-7-4(10)3(9)5(11)8(2)6(7)12/h1-2H3
charge 0 multiplicity 1
18 atoms
O  0.048973 -2.64645 -0.002387
O  -2.461627 1.295567 0.00246
O  2.41109 1.386052 0.002033
O  -0.051792 2.77335 -0.003473
N  -1.205979 -0.682344 0.001192
N  1.22958 -0.63699 0.000485
C  0.025315 -1.391827 -0.000615
C  -1.346939 0.723827 0.000867
C  1.318362 0.773223 0.000587
C  -0.028694 1.526776 -0.001276
C  -2.428893 -1.522556 0.002185
C  2.482718 -1.431519 0.00053
H  -3.295348 -0.846459 0.009963
H  -2.440981 -2.17184 0.89257
H  -2.450091 -2.161786 -0.895361
H  2.520461 -2.078518 0.891815
H  3.323681 -0.723902 0.006064
H  2.526062 -2.070501 -0.896337
