program: Gaussian 09
title: 000075986
version: EM64L-G09RevD.01
frameworkgroup: C1[X(C6H13NO2)]
method: RPBEPBE
basis: SDD
operation: Freq
keyword: #p
keyword: freq=noraman
keyword: PBEPBE/SDD
title: #p freq=noraman PBEPBE/SDD
converged: YES YES NO NO
title: Mulliken charges:
elementType: O O N C C C C C C H H H H H H H H H H H H H
charge: -0.245115 -0.457005 0.015268 -0.325714 -0.325878 -0.268323 -0.326304 -0.323602 -0.704894 0.209790 0.243906 0.247899 0.208713 0.199955 0.235215 0.239664 0.217427 0.217845 0.237463 0.216144 0.277238 0.210309
chargesum: 0.00000
title: Mulliken charges with hydrogens summed into heavy atoms:
elementType: O O N C C C C C C
charge: -0.245115 -0.457005 0.015268 0.127982 0.130734 0.166847 0.130786 0.131706 -0.001203
polarizability: 8.80862403e+01 -1.58217748e+00 7.73054544e+01 6.90757837e-01 2.44446426e-01 7.09075462e+01
1716.lowfreq: -31.8158 -11.5262 -0.0006 0.0003 0.0004 8.1629 105.8094 145.7519 210.1346
frequency: 105.6877 145.7326 210.1297 221.9152 233.0387 310.5997 341.6632 363.7395 416.1584 428.7027 485.8953 502.3657 576.5686 658.8679 766.4940 795.9003 804.6835 858.0678 891.6114 897.1151 978.2831 992.7768 1020.6336 1035.2810 1057.8022 1085.4377 1097.8293 1127.3628 1151.7462 1196.2442 1232.4709 1246.7762 1286.2797 1294.9453 1314.7798 1336.9509 1344.3166 1360.7974 1367.9432 1384.0732 1421.3066 1435.1974 1435.4338 1450.3562 1455.7473 1474.2675 1492.5818 2988.2362 2993.1927 2998.8944 3000.0795 3001.8242 3012.5616 3071.1021 3092.3150 3094.0374 3096.3399 3098.6514 3103.1052 3112.8045
redmass: 2.3472 2.9296 2.9229 1.5294 1.4129 5.5032 2.7529 2.4232 2.1430 3.0747 3.2709 3.6106 2.2903 3.0059 1.8514 1.4045 3.8516 4.0666 2.3765 2.9843 1.7783 1.8330 2.0978 2.2683 3.9132 2.6207 2.7146 2.2659 1.7101 1.1773 1.2019 1.2340 1.1973 1.2564 1.2688 1.2559 1.2560 1.2823 1.2442 1.3006 1.0947 1.0791 1.0888 1.0874 1.1001 1.0545 1.0520 1.0488 1.0479 1.0638 1.0642 1.0590 1.0607 1.1003 1.1000 1.1005 1.1015 1.1032 1.1019 1.1016
irintensity: 0.3795 5.8386 7.8058 11.1826 2.8489 4.4892 15.3455 9.4406 2.7027 7.7763 3.7478 13.5614 7.7986 0.4888 0.1125 5.5918 15.0486 22.8713 1.9492 5.5093 2.4748 0.5800 21.7728 13.3595 46.3163 1.5016 11.2265 7.0079 6.7308 0.4352 7.9669 13.6296 4.9791 2.2820 1.2989 3.5454 10.2883 12.0171 12.5146 30.6685 1.7393 4.8980 14.4156 14.7277 9.1968 14.0871 12.2131 24.8329 19.3889 41.3860 39.0122 7.0281 59.4357 3.1001 9.5776 47.3365 3.4473 14.5773 29.4911 14.5011
temp: 298.150 k
press: 1.00000 atm
elementType: 8 8 7 6 6 6 6 6 6 1 1 1 1 1 1 1 1 1 1 1 1 1
symmnumber: 1
zpe: 500970.3 jmol-1
zpe.correction: 0.190810 hartree
zpe.thermalcorrener: 0.199913 hartree
zpe.thermalcorrenthalpy: 0.200857 hartree
zpe.thermalcorrgfe: 0.157583 hartree
zpe.sumelectzpe: -440.789778 hartree
zpe.sumelectthermal: -440.780674 hartree
zpe.sumelectthermalent: -440.779730 hartree
zpe.sumelectthermalfe: -440.823005 hartree
dipole: -1.4895 -0.2906 -3.4178
dipole: 3.7396
quadrupole: -58.8595 -49.0548 -60.9488
quadrupole: -1.7121 5.0446 1.4773
quadrupole: -2.5718 7.2329 -4.6611 -1.7121 5.0446 1.4773
hfenergy: -440.9805873 hartree
pointgroup: C01 [X(C6H13N1O2)]
dipole: -0.5584277 -0.0434828 -1.3604641 debye
dipolederiv: -0.5557266 0.0437285 -0.0698238 0.0478873 -0.7614317 -0.0238387 -0.0369828 -0.0186762 -0.3891758 -0.6761299 0.0017003 0.0095995 0.0090027 -0.5184139 0.029 -0.0099662 -0.0053478 -0.5439214 0.0384807 0.0110194 -0.0440455 0.0141274 0.075195 -0.046687 -0.0489447 -0.0325054 0.2944621 -0.0005643 -0.1004042 -0.0111401 -0.0743211 0.0800512 -0.0256818 -0.0646331 0.0139261 0.0957735 -0.0547635 0.0709168 -0.0182182 0.0258087 0.0934151 0.0292533 -0.068589 -0.0200068 0.0809253 0.3042327 0.0203414 -0.0207442 0.0146397 0.0907544 -0.0075937 0.0256665 -0.010253 0.1386195 0.25942 0.1358197 0.0092773 0.0698809 0.5525395 -0.0294064 0.0813916 -0.0878683 0.2736073 0.3771873 -0.2075752 -0.0205562 -0.1409098 0.4531378 0.0409309 0.0433782 0.1224874 0.2754336 -0.153166 0.0831459 0.0260247 0.0556391 0.0454798 -0.0535607 -0.0459706 -0.0396888 -0.0604374 0.0181664 0.0479371 -0.0068795 0.0553762 0.0589827 0.0204358 0.0017459 -0.0361548 -0.1652274 0.0340312 -0.1159369 0.0178551 -0.0462884 -0.0613704 0.0084874 0.0294545 0.0442484 0.0794496 0.0056916 0.1183364 0.0279371 0.0698475 -0.0018806 -0.0074213 0.0477297 -0.0310317 0.069363 0.0560992 -0.0491357 -0.0001223 -0.0518051 0.021412 -0.0029441 -0.0145932 0.0427949 -0.1569021 -0.0308458 0.0026196 0.0500021 0.0086979 0.0783095 0.0121733 0.0049096 -0.0193974 -0.1802061 0.0323081 0.0114398 -0.0116052 -0.0313952 -0.1206908 0.0045533 0.0022684 0.0474083 0.0731054 0.119626 -0.0707892 0.0285453 -0.0423962 0.0136446 -0.0164021 -0.0571087 0.0795589 -0.1015899 -0.0403534 0.101473 0.0355578 0.0767263 -0.0588788 -0.0350315 0.0657233 -0.0664884 0.0857878 0.013008 -0.0688311 0.0180469 -0.0523003 -0.1207236 0.0297016 0.0370925 0.0685041 0.093305 0.0709573 0.0871595 0.0262168 0.0668931 0.0630674 0.0351416 -0.0244533 -0.0830445 -0.1023197 -0.1360117 -0.0526016 -0.0557291 -0.0776525 0.0615011 -0.0282164 -0.0712272 -0.0259786 0.1110322 0.22624 -0.0224285 -0.0260481 -0.0113383 0.0926998 -0.0017589 0.0795598 -0.0264452 -0.0263174 0.0921127 -0.0479347 0.0358494 0.0138801 -0.1368 0.0688654 0.0235487 0.0839589 0.0552327 unknown
polarizability: 87.9885965|-1.8216595|77.3346718|0.9879843|0.4780773|70.9759727 unknown
InChI: InChI=1S/C6H13NO2/c1-2-7(8)3-5-9-6-4-7/h2-6H2,1H3
charge 0 multiplicity 1
22 atoms
O  2.358415 0.31752 -0.268518
O  -0.617131 -0.267484 1.448445
N  -0.514279 -0.198567 0.028476
C  0.474325 -1.274468 -0.473649
C  0.041666 1.181097 -0.397542
C  -1.890796 -0.456293 -0.626064
C  1.853274 -1.006296 0.13727
C  1.433518 1.357748 0.216024
C  -2.9640 0.48207 -0.071531
H  0.512102 -1.243689 -1.579336
H  0.071257 -2.239331 -0.124508
H  -0.656799 1.931724 0.003041
H  0.078861 1.230953 -1.50217
H  -1.777639 -0.376736 -1.725299
H  -2.125195 -1.500851 -0.358794
H  1.768806 -1.06599 1.239946
H  2.5900 -1.73655 -0.234642
H  1.873579 2.319879 -0.092027
H  1.338889 1.307523 1.318591
H  -3.965251 0.102374 -0.340603
H  -2.864897 0.496423 1.027837
H  -2.878406 1.511444 -0.461947
