program: Gaussian 09
title: 000076035
version: EM64L-G09RevD.01
frameworkgroup: C1[X(C14H18O)]
method: RPBEPBE
basis: SDD
operation: Freq
keyword: #pfreq=noraman
keyword: PBEPBE/SDD
title: #p freq=noraman PBEPBE/SDD
converged: YES YES NO NO
title: Mulliken charges:
elementType: O C C C C C C C C C C C C C C H H H H H H H H H H H H H H H H H H
charge: -0.218491 -0.138243 -0.445704 -0.445364 -0.401411 -0.394868 -0.384951 0.064580 0.312995 -0.353052 -0.358779 -0.440564 -0.358410 0.440674 -0.807033 0.207965 0.226753 0.206617 0.220066 0.217925 0.201921 0.188710 0.188300 0.203782 0.198896 0.194110 0.233763 0.277298 0.232463 0.233225 0.235041 0.235017 0.226769
chargesum: 0.00000
title: Mulliken charges with hydrogens summed into heavy atoms:
elementType: O C C C C C C C C C C C C C C
charge: -0.218491 0.069722 -0.012333 -0.007373 -0.010780 -0.002787 0.008055 0.064580 0.312995 -0.119289 -0.081481 -0.208101 -0.125185 0.440674 -0.110206
polarizability: 2.16434074e+02 -8.63507678e+00 1.44430409e+02 -1.86872955e+00 -8.51856378e+00 9.92007471e+01
1716.lowfreq: -19.6636 -13.0849 -11.2432 -6.8344 -0.0006 0.0001 0.0002 25.1247 49.0673
frequency: -19.4102 24.4183 48.4705 69.0474 98.1271 135.7355 189.0846 217.8837 239.8947 270.7543 290.9982 340.8888 346.2617 401.5084 406.3060 427.4200 472.2415 482.7075 509.9494 595.2304 634.2177 678.1072 735.0865 761.0372 781.7917 787.0248 814.9172 833.9187 853.8474 862.9257 879.4370 891.2722 919.6354 965.1806 968.5459 985.9509 1002.6451 1011.2925 1029.3751 1047.5857 1047.7446 1055.6941 1072.1658 1111.2784 1122.1950 1133.7604 1173.4137 1192.5850 1209.0724 1224.9173 1247.6239 1253.9620 1263.1844 1283.5157 1303.8938 1310.6633 1322.6532 1332.6561 1339.5894 1346.7157 1357.6340 1371.9171 1396.8688 1410.3916 1458.5151 1459.3628 1462.2882 1468.3546 1468.5027 1471.6182 1477.6726 1499.8425 1555.5515 1587.9791 1620.3845 2961.6102 2961.8373 2968.2744 2971.1189 2978.3154 2979.7052 2992.2683 3024.8414 3027.4766 3034.8333 3042.6200 3056.5580 3056.6874 3087.6751 3122.5665 3125.6785 3153.0931 3158.3144
redmass: 1.0354 3.9449 3.3722 3.2172 4.7535 3.3989 3.3847 1.9877 3.8662 3.5312 2.9297 2.2836 3.9242 2.8024 2.8597 3.0448 2.7706 2.8154 1.8815 5.1028 6.8832 4.3571 3.0240 2.8588 1.7843 2.1869 4.5928 1.4735 2.0814 1.3473 1.8742 1.5364 1.9400 2.4866 1.4837 1.4737 1.3575 2.8627 2.3857 1.6587 1.7824 1.1929 1.4659 2.3408 1.3559 2.2235 1.4225 1.1972 1.8768 2.6347 1.6546 1.3277 1.2957 1.3439 1.3049 1.3599 1.3641 1.3754 1.4850 1.4983 1.6381 3.9252 1.2583 3.6040 1.0870 1.0879 1.0857 1.0456 1.0866 1.1181 1.0907 2.6098 6.8796 7.3275 6.4449 1.0629 1.0637 1.0627 1.0771 1.0373 1.0643 1.0621 1.0972 1.0941 1.1024 1.1036 1.0974 1.1020 1.0989 1.0891 1.0883 1.0942 1.0956
irintensity: 0.6588 0.8816 0.1662 0.4317 0.4128 1.8764 2.8657 0.1750 0.4347 2.7715 1.0218 0.0624 5.6295 0.6511 0.1260 0.5559 4.2860 14.0635 0.4023 8.2774 0.6036 8.8638 7.3723 13.6099 1.7955 1.6406 5.4625 26.2687 3.0851 8.0160 5.8717 19.5082 4.8163 44.8781 6.0184 15.0620 2.1388 4.3955 7.7380 9.5645 5.6030 0.3082 0.3845 0.5249 13.8665 8.4718 38.2433 32.5375 37.5301 0.1325 82.1060 4.4061 7.6750 56.3366 2.7885 17.2662 13.3416 0.4853 1.3462 6.5675 15.7896 5.4008 15.2907 16.0960 8.4153 3.1408 10.3469 13.0829 17.6530 13.7038 5.7284 0.0513 110.3666 59.6526 44.3184 28.5203 39.3147 42.2318 9.7529 28.2830 25.1429 20.0443 75.5371 77.0636 25.2419 44.2820 11.0150 79.2584 18.5236 14.7481 18.9453 22.6310 2.4382
temp: 298.150 k
press: 1.00000 atm
elementType: 8 6 6 6 6 6 6 6 6 6 6 6 6 6 6 1 1 1 1 1 1 1 1 1 1 1 1 1 1 1 1 1 1
symmnumber: 1
zpe: 742452.5 jmol-1
zpe.correction: 0.282785 hartree
zpe.thermalcorrener: 0.296278 hartree
zpe.thermalcorrenthalpy: 0.297222 hartree
zpe.thermalcorrgfe: 0.241558 hartree
zpe.sumelectzpe: -618.404315 hartree
zpe.sumelectthermal: -618.390822 hartree
zpe.sumelectthermalent: -618.389878 hartree
zpe.sumelectthermalfe: -618.445542 hartree
dipole: 1.5711 -3.1748 0.6146
dipole: 3.5952
quadrupole: -75.3083 -94.2453 -92.0339
quadrupole: 1.3653 -0.5428 -0.4200
quadrupole: 11.8875 -7.0495 -4.8380 1.3653 -0.5428 -0.4200
hfenergy: -618.6871 hartree
pointgroup: C01 [X(C14H18O1)]
dipole: 0.5901287 -1.0812062 -0.6953244 debye
polarizability: 215.4723579|-3.4751387|132.2636302|-12.6627205|21.9223546|112.3292418 unknown
InChI: InChI=1S/C14H18O/c1-11-7-9-13(10-8-11)14(15)12-5-3-2-4-6-12/h7-10,12H,2-6H2,1H3
charge 0 multiplicity 1
33 atoms
O  -0.545464 1.894145 1.261368
C  -1.591901 -0.12752 0.39638
C  -2.767742 0.143794 1.366731
C  -2.043394 0.109371 -1.083501
C  -4.003107 -0.714469 1.010445
C  -3.277791 -0.753577 -1.434719
C  -4.446308 -0.493224 -0.455258
C  -0.38235 0.764909 0.704801
C  0.99824 0.316113 0.307059
C  1.265313 -0.92664 -0.326596
C  2.09319 1.182972 0.580302
C  2.58479 -1.287625 -0.673749
C  3.405315 0.817695 0.236062
C  3.677377 -0.426476 -0.398489
C  5.097483 -0.814142 -0.766061
H  -1.298192 -1.193349 0.490105
H  -3.02169 1.219536 1.321802
H  -2.446244 -0.056936 2.406748
H  -1.211361 -0.107427 -1.780688
H  -2.294566 1.182504 -1.203118
H  -4.835409 -0.47473 1.700261
H  -3.765269 -1.78873 1.160255
H  -2.998928 -1.827467 -1.394495
H  -3.593565 -0.543341 -2.475223
H  -5.304014 -1.149148 -0.700836
H  -4.795398 0.553021 -0.576221
H  0.449686 -1.621623 -0.551446
H  1.877346 2.139615 1.067867
H  2.771532 -2.25123 -1.16247
H  4.235838 1.498978 0.458686
H  5.54286 -0.082191 -1.465974
H  5.748232 -0.842016 0.128133
H  5.137792 -1.807293 -1.244661
