program: Gaussian 09
title: 000075956
version: EM64L-G09RevD.01
frameworkgroup: C1[X(C8H19O4P)]
method: RPBEPBE
basis: SDD
operation: Freq
keyword: #p
keyword: freq=noraman
keyword: PBEPBE/SDD
title: #p freq=noraman PBEPBE/SDD
converged: NO YES NO NO
title: Mulliken charges:
elementType: P O O O O C C C C C C C C H H H H H H H H H H H H H H H H H H H
charge: 1.409286 -0.498010 -0.522800 -0.522845 -0.621598 -0.353772 -0.256994 -0.349320 -0.682277 -0.226043 -0.225884 -0.654645 -0.654732 0.210235 0.210751 0.221081 0.220377 0.195314 0.195383 0.212858 0.212798 0.217785 0.239452 0.217903 0.218001 0.239330 0.210123 0.227863 0.236220 0.210167 0.236259 0.227733
chargesum: 0.00000
title: Mulliken charges with hydrogens summed into heavy atoms:
elementType: P O O O O C C C C C C C C
charge: 1.409286 -0.498010 -0.522800 -0.522845 -0.621598 0.067215 0.184464 0.041377 -0.038836 0.231313 0.231447 0.019561 0.019428
polarizability: 1.42639995e+02 -2.15384874e-01 1.35727805e+02 3.47419246e+00 7.47355517e-02 1.08429089e+02
1716.lowfreq: -34.8708 -17.2149 -7.6938 -0.0020 -0.0015 -0.0006 2.1072 15.8610 23.0435
frequency: -34.7970 15.5620 22.1284 23.2360 37.1376 40.7614 64.4512 97.8634 100.5508 114.1702 158.9500 168.7641 230.5006 236.1794 239.3732 247.2911 262.3343 274.4127 281.1662 309.4175 371.0661 413.2857 456.2538 467.4638 628.8197 689.9399 724.0310 741.4700 804.1451 807.1878 807.8058 873.3661 886.8653 900.1049 929.7353 933.0559 1014.7705 1026.9099 1036.9853 1054.3961 1081.3742 1103.2189 1109.8425 1118.7085 1130.7465 1132.8076 1144.0657 1209.7364 1253.5563 1254.9912 1270.3751 1273.6460 1283.7317 1342.0142 1359.1286 1361.9540 1368.7320 1391.9754 1395.5893 1396.2426 1457.0292 1457.2405 1467.9387 1473.4943 1476.8888 1477.4872 1478.4788 1484.0513 1488.6453 1489.4978 1491.5209 2967.5748 2976.1747 2985.0716 2991.3628 2991.7801 2996.2140 2996.6500 2997.1575 3011.4084 3040.7446 3057.7702 3058.1219 3067.3870 3076.0999 3077.1373 3091.7744 3091.9130 3110.2432 3110.4375
redmass: 2.1962 2.1052 2.5773 3.0173 1.9028 2.6285 4.0876 2.9605 4.9173 2.0271 5.6833 3.9503 1.3517 1.5539 1.1019 2.5881 3.5255 5.0121 3.7753 3.5661 3.7293 6.4356 4.5416 6.7263 7.1259 5.9722 9.7580 1.0719 1.1292 1.0878 1.0879 4.9832 3.4884 1.8368 8.0858 1.1609 2.3611 2.8718 3.6879 9.9426 2.2922 2.2361 2.3058 2.5785 1.4165 1.4271 1.4176 1.3782 1.1453 1.1430 1.2824 1.1689 1.0770 1.4259 1.2544 1.2629 1.3900 1.2126 1.2505 1.2525 1.0402 1.0402 1.0766 1.0688 1.0535 1.0535 1.0421 1.0672 1.0792 1.0809 1.0877 1.0586 1.0362 1.0566 1.0519 1.0505 1.0420 1.0436 1.0583 1.1006 1.1051 1.1070 1.1071 1.1052 1.0995 1.1033 1.0981 1.0980 1.1022 1.1022
irintensity: 0.0172 0.1891 0.9656 1.1267 4.6165 0.5792 0.6442 0.3252 2.3412 2.3332 9.8617 3.0421 2.7776 2.1091 0.0032 5.0402 14.4165 12.0327 10.7481 0.3425 5.1085 36.8854 6.4124 22.2792 11.9894 101.5512 167.0647 7.9747 1.0352 1.9098 6.7086 395.5538 64.8944 27.9701 193.2457 1.4953 200.0162 48.4286 28.5576 91.6725 1.2740 9.2064 16.9955 16.2071 0.2010 10.8034 1.5520 0.1046 1.0993 0.1461 3.9757 1.2590 0.0683 0.3425 13.6942 0.7441 13.6984 8.6402 29.4406 27.6888 4.8684 19.9586 0.3967 0.4091 10.0306 4.5100 12.9514 4.0431 0.8950 31.4795 4.9379 27.2134 34.2053 18.4898 7.0510 43.3874 50.0972 2.1959 49.2918 9.5457 0.1983 0.7782 22.7735 2.3418 48.5585 119.2326 24.1112 35.1907 9.7633 64.3138
temp: 298.150 k
press: 1.00000 atm
elementType: 15 8 8 8 8 6 6 6 6 6 6 6 6 1 1 1 1 1 1 1 1 1 1 1 1 1 1 1 1 1 1 1
symmnumber: 1
zpe: 702277.6 jmol-1
zpe.correction: 0.267483 hartree
zpe.thermalcorrener: 0.285333 hartree
zpe.thermalcorrenthalpy: 0.286277 hartree
zpe.thermalcorrgfe: 0.217145 hartree
zpe.sumelectzpe: -957.255947 hartree
zpe.sumelectthermal: -957.238097 hartree
zpe.sumelectthermalent: -957.237153 hartree
zpe.sumelectthermalfe: -957.306285 hartree
dipole: -1.5313 -0.0169 -2.4906
dipole: 2.9237
quadrupole: -83.0894 -71.6228 -98.9061
quadrupole: -0.1596 -2.8822 -0.0371
quadrupole: 1.4500 12.9166 -14.3667 -0.1596 -2.8822 -0.0371
hfenergy: -957.5234305 hartree
pointgroup: C01 [X(C8H19O4P1)]
dipole: 0.6189305 0.0079452 0.9695519 debye
polarizability: 142.7357757|0.3641218|135.7394432|2.8947334|-0.0709532|108.3216698 unknown
InChI: InChI=1S/C8H19O4P/c1-4-7-8-12-13(9,10-5-2)11-6-3/h4-8H2,1-3H3
charge 0 multiplicity 1
32 atoms
P  -1.077198 -0.021917 -0.633388
O  0.613464 -0.006887 -0.985597
O  -1.293525 -1.319359 0.48705
O  -1.314678 1.275648 0.482604
O  -1.963475 -0.031598 -1.948307
C  2.984044 0.039625 -0.513609
C  1.601345 -0.001147 0.137405
C  4.119018 0.038963 0.538643
C  5.518827 0.082049 -0.111373
C  -1.802647 -2.620161 -0.054434
C  -1.837039 2.568554 -0.065232
C  -1.988618 -3.528122 1.156168
C  -2.02339 3.483706 1.139898
H  3.056898 0.943922 -1.147407
H  3.090901 -0.833966 -1.184617
H  1.41977 0.886227 0.773848
H  1.460379 -0.915112 0.745776
H  3.999166 0.909642 1.215111
H  4.03491 -0.865645 1.17473
H  5.677517 -0.792558 -0.769561
H  5.642153 0.992245 -0.727536
H  6.317031 0.079878 0.653113
H  -2.752072 -2.437916 -0.590524
H  -1.06387 -3.031896 -0.76879
H  -1.105953 2.981222 -0.786941
H  -2.788144 2.374934 -0.594267
H  -2.369087 -4.514026 0.830214
H  -1.031743 -3.678895 1.684192
H  -2.712311 -3.088269 1.862791
H  -2.414863 4.463697 0.80917
H  -2.738626 3.042611 1.854323
H  -1.064582 3.64695 1.660644
