program: Gaussian 09
title: 000075987
version: EM64L-G09RevD.01
frameworkgroup: C1[X(C12H18O6)]
method: RPBEPBE
basis: SDD
operation: Freq
keyword: #pfreq=noraman
keyword: PBEPBE/SDD
title: #p freq=noraman PBEPBE/SDD
converged: YES YES NO NO
title: Mulliken charges:
elementType: O O O O O O C C C C C C C C C C C C H H H H H H H H H H H H H H H H H H
charge: -0.326330 -0.305750 -0.271438 -0.261343 -0.237069 -0.270048 -0.013882 -0.026546 -0.352047 -0.378970 -0.306765 -0.308511 -0.386318 -0.386276 -0.494307 -0.493488 0.265764 0.292348 0.231899 0.240003 0.261885 0.231136 0.276867 0.216914 0.258444 0.222939 0.249721 0.233441 0.256188 0.206022 0.212081 0.247063 0.223409 0.236273 0.214618 0.242072
chargesum: 0.00000
title: Mulliken charges with hydrogens summed into heavy atoms:
elementType: O O O O O O C C C C C C C C C C C C
charge: -0.326330 -0.305750 -0.271438 -0.261343 -0.237069 -0.270048 0.218017 0.213457 0.140975 0.114811 0.174618 0.174651 0.075892 0.072868 -0.034625 -0.036798 0.265764 0.292348
polarizability: 1.54870711e+02 -7.10860268e+00 1.48472327e+02 -3.13060136e+00 -7.98343359e-01 1.26137307e+02
1716.lowfreq: -10.7028 -0.0004 0.0005 0.0010 2.2507 8.1819 15.5862 26.5037 41.0839
frequency: 13.9712 26.2241 41.0575 47.5671 50.7014 62.1886 66.3759 76.1300 112.5818 121.8081 132.1712 168.6241 199.0495 215.0074 228.2651 270.8896 279.5338 289.3739 314.4181 344.2198 394.5269 404.1015 440.4505 469.3033 557.8537 587.7531 592.4424 668.1955 684.1191 698.1051 728.5082 773.1965 789.3470 792.0842 801.6575 816.5832 835.7744 882.5583 902.8791 909.9877 919.0303 929.6300 957.6202 983.2030 1001.0032 1030.4713 1033.4289 1041.2595 1047.0553 1054.9353 1062.8294 1097.1210 1102.8243 1122.2903 1124.9881 1131.4954 1138.9344 1150.5729 1188.9803 1206.3741 1211.9548 1230.4088 1240.1083 1247.1832 1255.3554 1280.4108 1314.1787 1318.3551 1322.8601 1341.9758 1357.2901 1372.7085 1390.7216 1405.9785 1451.2731 1453.0672 1455.0664 1467.6310 1469.1722 1472.1392 1482.0097 1492.4772 1631.8041 1655.0920 2985.1331 2993.7107 3010.3875 3011.1361 3018.2545 3024.2935 3041.8975 3063.3613 3072.7047 3076.6892 3079.8750 3089.6805 3092.4047 3092.5779 3096.8721 3116.4119 3181.0938 3204.6398
redmass: 6.5300 5.8161 5.8462 5.4573 5.3264 6.4295 6.5849 3.5845 3.6083 3.3654 3.6998 3.1321 2.6847 4.0699 6.0630 3.7585 3.5523 3.9738 3.4463 2.2723 2.7123 2.7134 3.6162 2.7890 3.6347 4.3128 4.1162 3.0478 4.4261 3.3939 5.7498 3.0384 4.3945 4.0495 3.0142 2.3128 3.0090 2.9638 1.8399 1.5487 1.8908 2.6430 2.2529 2.1534 1.5301 1.2799 2.2353 2.4162 2.2129 2.2685 1.8548 1.3925 1.3334 1.8073 1.3355 2.0304 1.2899 1.5666 1.7363 1.3054 1.6174 1.3623 1.4493 1.3346 1.2220 1.2838 1.1455 1.3391 1.3298 1.4355 1.5322 1.5130 1.8853 2.1533 1.0902 1.0868 1.1065 1.1044 1.1124 1.2092 1.1113 1.1528 9.8933 9.8482 1.0605 1.0650 1.0567 1.0639 1.0598 1.0596 1.0963 1.0533 1.1017 1.1013 1.0738 1.0751 1.1017 1.1007 1.1001 1.0963 1.1204 1.1180
irintensity: 2.3939 0.9294 2.5624 3.1776 1.6852 0.8666 0.5155 1.2354 3.0079 7.6456 0.9375 2.7628 2.1921 3.0426 1.3474 14.3369 12.2790 21.0762 8.0864 10.0272 0.7971 8.4580 1.6470 6.4843 4.6541 2.7404 3.8581 3.5918 15.9787 4.5999 11.9030 6.4874 26.0789 63.5909 2.8925 1.5046 5.5941 5.3752 1.1849 4.5251 9.8553 61.2899 53.1727 33.0158 9.3289 2.0959 51.7101 8.0201 31.0830 119.3595 13.0286 5.7220 6.8521 74.1288 10.0882 134.6969 5.8747 4.0390 119.9909 12.6542 32.8681 15.7534 0.0860 94.4518 1.5439 26.2659 0.4124 4.3081 17.6081 6.3531 7.8459 6.9379 6.9338 4.9228 24.2241 16.7467 12.3967 1.5569 9.0235 0.7843 15.8009 2.0526 156.0217 185.1649 15.3277 36.1818 31.0133 9.7729 23.4558 24.3438 17.6414 23.5518 19.6885 7.7511 18.0904 37.2063 12.5735 21.0285 5.5984 34.8805 9.9083 10.3038
temp: 298.150 k
press: 1.00000 atm
elementType: 8 8 8 8 8 8 6 6 6 6 6 6 6 6 6 6 6 6 1 1 1 1 1 1 1 1 1 1 1 1 1 1 1 1 1 1
symmnumber: 1
zpe: 757738.5 jmol-1
zpe.correction: 0.288607 hartree
zpe.thermalcorrener: 0.308126 hartree
zpe.thermalcorrenthalpy: 0.309071 hartree
zpe.thermalcorrgfe: 0.236930 hartree
zpe.sumelectzpe: -917.909929 hartree
zpe.sumelectthermal: -917.890410 hartree
zpe.sumelectthermalent: -917.889466 hartree
zpe.sumelectthermalfe: -917.961606 hartree
dipole: -1.9805 0.4383 -0.7157
dipole: 2.1510
quadrupole: -113.1546 -91.7204 -111.6909
quadrupole: 5.7702 8.8333 5.7526
quadrupole: -7.6326 13.8016 -6.1689 5.7702 8.8333 5.7526
hfenergy: -918.1985366 hartree
pointgroup: C01 [X(C12H18O6)]
dipole: -0.754296 0.2384017 -0.3005849 debye
polarizability: 153.1961862|-7.8557053|149.9628028|-2.6051231|-2.1832893|126.3213555 unknown
InChI: InChI=1S/C12H18O6/c13-11(17-7-9-5-15-9)3-1-2-4-12(14)18-8-10-6-16-10/h9-10H,1-8H2
charge 0 multiplicity 1
36 atoms
O  0.026883 -1.577092 0.147449
O  4.203987 -1.880879 0.4329
O  -2.796223 -0.779422 -0.428882
O  2.367418 1.381204 0.116062
O  -3.168049 -0.163678 1.798661
O  0.96903 1.34058 -1.750114
C  -1.047824 -2.517434 -0.341253
C  3.826358 -0.443055 0.710454
C  -0.227842 -1.767779 -1.341414
C  3.1235 -1.540391 1.445035
C  -2.483916 -2.163096 -0.009121
C  3.148551 0.242354 -0.453663
C  -1.912824 2.135077 -0.500669
C  -0.880706 2.324791 0.633048
C  -3.258563 1.53772 0.001024
C  0.488783 2.875099 0.134037
C  -3.084638 0.151542 0.59275
C  1.264822 1.815916 -0.627504
H  -0.811055 -3.577324 -0.164869
H  4.605156 0.129301 1.229853
H  -0.648551 -0.884719 -1.830713
H  0.574599 -2.289032 -1.876944
H  2.103862 -1.807636 1.140589
H  3.401235 -1.741819 2.486489
H  -2.675147 -2.260897 1.075317
H  -3.169678 -2.820267 -0.573686
H  2.467165 -0.447142 -0.978274
H  3.877172 0.649507 -1.177304
H  -1.494299 1.487913 -1.29058
H  -2.12699 3.11551 -0.970246
H  -1.282646 3.035421 1.381541
H  -0.713506 1.367796 1.163358
H  -3.698808 2.178951 0.783958
H  -3.963688 1.476348 -0.847527
H  0.316758 3.735644 -0.539645
H  1.094975 3.213687 0.989883
