program: Gaussian 09
title: 000004699
version: EM64L-G09RevD.01
frameworkgroup: C1[X(C18H28N3O8P)]
method: RPBEPBE
basis: SDD
operation: Freq
keyword: #p
keyword: freq=noraman
keyword: PBEPBE/SDD
title: #p freq=noraman PBEPBE/SDD
converged: YES YES NO NO
title: Mulliken charges:
elementType: P O O O O O O O O N N N C C C C C C C C C C C C C C C C C C H H H H H H H H H H H H H H H H H H H H H H H H H H H H
charge: 1.358200 -0.518308 -0.239128 -0.330898 -0.647250 -0.699361 -0.614848 -0.207510 -0.202939 -0.440097 -0.432736 0.023406 -0.433312 -0.185190 -0.050495 -0.158962 -0.401966 0.221701 -0.343804 -0.703165 -0.713402 0.208476 -0.355255 -0.697855 0.505958 -0.430798 -0.300591 -0.342019 -0.359426 0.395935 0.266360 0.286308 0.264289 0.207474 0.250623 0.244959 0.204687 0.336840 0.235736 0.176090 0.234476 0.210646 0.215890 0.239892 0.226155 0.174553 0.201869 0.190408 0.329286 0.215303 0.215437 0.208641 0.239195 0.314459 0.292417 0.291796 0.396284 0.425565
chargesum: 0.00000
title: Mulliken charges with hydrogens summed into heavy atoms:
elementType: P O O O O O O O O N N N C C C C C C C C C C C C C C C C C C
charge: 1.358200 -0.518308 -0.239128 -0.330898 -0.250966 -0.273797 -0.614848 -0.207510 -0.202939 -0.103257 -0.103450 0.023406 0.119355 0.079100 0.156979 0.091661 0.047679 0.221701 0.068022 -0.042152 -0.072802 0.208476 0.037023 -0.058474 0.505958 -0.191603 0.013869 -0.049602 -0.067630 0.395935
polarizability: 4.16096881e+02 -1.51012451e+01 2.63894339e+02 -1.72417085e+00 -2.26655913e+01 1.96602697e+02
1716.lowfreq: -13.5223 -6.3109 -3.4525 -0.0014 -0.0011 0.0006 12.9486 23.0653 28.9609
frequency: 12.5313 22.9750 28.8532 30.1166 31.6988 43.7162 54.3857 56.5160 59.0955 65.0923 72.9478 81.3049 89.8066 93.2604 116.0720 121.8222 128.5041 133.1644 139.4492 148.0769 167.6749 181.4457 197.5175 211.3659 217.6075 222.9887 224.8432 233.5820 238.3669 255.4895 259.3808 271.1064 310.4124 318.0094 323.0720 340.8593 351.8842 360.0506 374.5747 390.4715 403.1024 408.9191 416.0481 418.6714 438.8459 476.6765 507.8587 508.6618 554.3519 581.3657 605.8898 621.1113 639.2933 664.9010 666.7103 693.8629 696.9157 712.4516 718.0691 737.2422 742.3501 756.9064 766.3946 771.6038 795.6353 820.8659 827.1476 840.9269 849.4342 866.3768 877.8660 880.3667 894.0618 912.6633 928.0079 939.2207 947.5934 958.7271 969.0355 983.2293 1000.7579 1010.2263 1010.6617 1012.7813 1023.4604 1053.8728 1062.6484 1067.2963 1081.9284 1095.7443 1111.0694 1114.3341 1119.5998 1135.4355 1161.9044 1167.8549 1175.5307 1180.9194 1188.6322 1212.2792 1216.5695 1222.5870 1225.6345 1253.0547 1263.8669 1268.5850 1284.6472 1289.6852 1292.3039 1298.5038 1307.5212 1312.2545 1324.2010 1342.9972 1352.7998 1359.4251 1367.8051 1371.5833 1383.2768 1389.7297 1400.5375 1404.4670 1423.6012 1444.5209 1464.5332 1466.4042 1469.0005 1476.0613 1476.2406 1477.6870 1483.3034 1485.8700 1488.6560 1488.6700 1502.9278 1533.8744 1588.3918 1607.8011 1615.3120 1643.7681 2949.5580 2959.0752 2961.8529 2968.6081 2973.7409 2977.0038 2977.4664 2988.5788 2990.1432 2997.2218 3009.9132 3036.9799 3043.9939 3061.6927 3064.2541 3066.6906 3071.5621 3071.7593 3073.8636 3078.9020 3082.2820 3129.5946 3181.7193 3188.0056 3212.1818 3475.4792 3500.5890 3592.3722
redmass: 5.9054 5.3396 5.0153 4.5765 4.5720 5.9024 2.0192 2.9927 5.1619 4.1362 6.2328 4.0657 6.5165 5.9214 4.7809 3.1580 2.7181 3.1905 3.8715 4.5125 5.3642 2.8195 1.5090 2.4544 1.9901 5.8827 1.3924 1.6238 6.3895 2.1394 3.8797 3.6747 5.5599 5.2820 4.3352 4.8238 8.9423 6.1558 4.2294 5.2987 3.0744 3.0537 2.9805 4.3477 3.0589 3.5474 7.1816 3.0900 3.9539 1.3663 4.8244 6.5368 6.5999 5.3876 4.5578 5.1123 1.6876 2.5022 2.2795 1.4430 3.8793 4.3934 6.0598 6.4416 1.5611 2.7349 5.0021 1.3583 1.2132 2.2870 2.6527 1.5815 2.1223 1.2276 2.0260 1.9782 1.7182 2.0005 2.1256 1.3479 3.1684 3.7504 1.3432 2.3818 3.7313 2.2642 2.6199 1.7977 2.5844 3.0587 1.6963 2.2900 1.2958 2.2690 1.9378 1.3252 1.8433 1.4262 2.3980 1.6214 1.5622 4.2659 1.5692 1.4697 1.9055 1.2229 1.1988 1.1997 1.0600 1.3837 1.2615 1.4026 1.5682 1.3215 1.5525 2.8407 1.7932 2.0736 1.2274 1.2227 1.4650 3.2467 4.5607 1.0819 1.0465 1.0708 1.0654 1.0695 1.0437 1.0662 1.1696 2.0930 1.0660 1.0724 1.8220 2.2522 5.7515 4.0104 6.6682 5.5752 1.0492 1.0763 1.0609 1.0645 1.0362 1.0595 1.0563 1.0741 1.0748 1.0615 1.0967 1.0904 1.0950 1.0875 1.0882 1.0993 1.1002 1.0996 1.1002 1.0997 1.0999 1.0914 1.0913 1.0947 1.0953 1.0770 1.0768 1.0662
irintensity: 0.1754 0.7663 1.5493 0.9260 0.6558 5.1019 1.6285 0.7345 5.6630 0.9875 1.0980 0.7106 2.9129 2.1833 12.2507 12.8351 35.8392 5.2280 20.2554 8.2794 1.7953 22.3231 8.7405 2.6574 6.1094 3.5145 0.4602 6.2559 24.9771 7.3458 10.3522 4.7419 5.7430 43.8969 3.8871 11.9817 22.8596 31.0637 0.1857 81.6551 3.9838 13.0352 0.0961 17.5045 10.8949 7.4732 0.1987 14.0162 28.1068 184.1446 16.2950 1.1575 2.9050 18.3943 23.1428 65.1525 37.0090 39.3067 65.3841 22.0675 17.5687 0.5764 185.4159 72.5322 33.0305 11.4631 1.6573 29.6316 125.9590 38.6913 139.8771 119.7915 9.6749 2.0286 8.3053 62.9190 10.2708 14.3711 20.5422 0.9559 2.9251 24.9385 0.6432 23.8765 25.3374 33.3575 68.0862 37.1257 1.2919 26.6630 17.8583 7.4448 19.0986 1.8028 28.7110 74.0013 2.6650 195.4446 56.0672 3.0959 39.7280 398.9778 5.0774 31.3434 44.4215 0.7606 2.2200 5.0535 5.9535 22.6930 16.7589 5.5542 9.3520 3.6337 0.4451 63.0236 20.5753 40.1505 33.8783 12.0149 71.0779 136.6923 78.5383 4.3941 1.0954 12.0755 1.3264 20.6306 11.6484 3.7161 9.1658 19.9362 30.0491 15.2015 727.9232 276.5275 248.3199 23.5061 138.6627 138.0047 37.8116 38.8058 6.6982 52.7599 43.6871 39.2958 22.9899 12.9692 17.8578 4.9515 13.6253 76.9300 4.6763 799.1677 694.1822 17.9336 8.2736 75.3782 101.6445 86.2682 31.5854 10.0894 2.2260 3.4487 3.3664 58.4376 47.5778 80.7382
temp: 298.150 k
press: 1.00000 atm
elementType: 15 8 8 8 8 8 8 8 8 7 7 7 6 6 6 6 6 6 6 6 6 6 6 6 6 6 6 6 6 6 1 1 1 1 1 1 1 1 1 1 1 1 1 1 1 1 1 1 1 1 1 1 1 1 1 1 1 1
symmnumber: 1
zpe: 1199376.7 jmol-1
zpe.correction: 0.456818 hartree
zpe.thermalcorrener: 0.490429 hartree
zpe.thermalcorrenthalpy: 0.491373 hartree
zpe.thermalcorrgfe: 0.387732 hartree
zpe.sumelectzpe: -1807.629833 hartree
zpe.sumelectthermal: -1807.596222 hartree
zpe.sumelectthermalent: -1807.595278 hartree
zpe.sumelectthermalfe: -1807.698919 hartree
dipole: 0.0898 3.0407 -2.4549
dipole: 3.9090
quadrupole: -244.7613 -190.6115 -181.3038
quadrupole: 29.0597 -0.2194 -4.7233
quadrupole: -39.2024 14.9474 24.2551 29.0597 -0.2194 -4.7233
hfenergy: -1808.086651 hartree
pointgroup: C01 [X(C18H28N3O8P1)]
dipole: 0.1945522 -0.1624962 1.5168947 debye
polarizability: 402.7550269|-41.2551661|213.7004607|-36.7154635|-25.1736657|260.1384302 unknown
InChI: InChI=1S/C18H28N3O8P/c1-4-5-6-16(29-30(26,27)28)18(23)20-15(11-12(2)3)17(22)19-13-7-9-14(10-8-13)21(24)25/h7-10,12,15-16,19-20,26-27H,4-6,11H2,1-3H3
charge 0 multiplicity 1
58 atoms
P  -2.861701 0.137555 -2.077703
O  -3.865305 0.736017 -0.818323
O  -2.78653 -0.120271 2.185851
O  0.810838 0.336992 -1.219076
O  -3.883782 0.583371 -3.376222
O  -1.553006 1.243681 -2.169683
O  -2.435999 -1.395804 -2.051389
O  8.370288 -0.953966 -1.643647
O  7.424312 -0.035419 -3.507439
N  -1.125302 0.562819 0.678765
N  2.302742 -0.554408 0.340064
N  7.356985 -0.498178 -2.303773
C  -0.640421 -1.899866 0.789608
C  -0.083825 -0.441716 0.949175
C  0.33725 -3.05412 1.128072
C  -3.350099 1.493917 0.376253
C  -4.593613 1.91918 1.153012
C  -2.408972 0.569676 1.19703
C  -5.519578 2.864655 0.359956
C  -0.384742 -4.400251 0.869362
C  0.848513 -3.003565 2.590612
C  1.040279 -0.177471 -0.071859
C  -6.778014 3.259139 1.165652
C  -7.710718 4.210456 0.385994
C  3.532981 -0.519285 -0.37249
C  4.68267 -1.009469 0.308862
C  3.649562 -0.022094 -1.699838
C  5.93729 -1.00597 -0.317999
C  4.907232 -0.018454 -2.3288
C  6.035523 -0.507341 -1.636183
H  -1.513133 -1.966822 1.465045
H  -1.02204 -2.005976 -0.243515
H  0.30197 -0.312517 1.980946
H  1.20984 -3.015564 0.441605
H  -2.792305 2.37305 -0.006584
H  -5.133873 1.007112 1.465141
H  -4.248856 2.412876 2.084474
H  -0.936483 1.217156 -0.088054
H  -5.81815 2.371945 -0.584078
H  -4.964903 3.784213 0.076627
H  -0.741491 -4.46572 -0.174146
H  0.289177 -5.255951 1.058397
H  -1.263896 -4.504291 1.532871
H  -0.00161 -3.024698 3.297854
H  1.494798 -3.873206 2.809559
H  1.436106 -2.091867 2.827723
H  -7.333166 2.340327 1.443735
H  -6.471831 3.73774 2.11886
H  2.354622 -0.948965 1.284445
H  -8.055026 3.742354 -0.555212
H  -8.604975 4.47706 0.978853
H  -7.188489 5.149279 0.120876
H  4.591959 -1.394734 1.331658
H  2.764704 0.351187 -2.215342
H  6.832986 -1.377378 0.185721
H  5.026789 0.358116 -3.347984
H  -3.858113 -0.058472 -4.13122
H  -0.635469 0.828936 -2.008598
