program: Gaussian 09
title: 000076025
version: EM64L-G09RevD.01
frameworkgroup: C1[X(C11H18O4P2S4)]
method: RPBEPBE
basis: SDD
operation: Freq
keyword: #p
keyword: freq=noraman
keyword: PBEPBE/SDD
title: #p freq=noraman PBEPBE/SDD
converged: NO YES NO NO
title: Mulliken charges:
elementType: S S S S P P O O O O C C C C C C C C C C C H H H H H H H H H H H H H H H H H H
charge: 0.021843 0.076969 -0.232793 -0.235768 0.604726 0.610117 -0.463066 -0.455211 -0.458610 -0.465947 0.510492 -0.809114 -0.366154 -0.352110 -0.227597 -0.219691 -0.141206 -0.482170 -0.481365 -0.477003 -0.472356 0.289681 0.311544 0.241081 0.240015 0.253661 0.270553 0.250509 0.248705 0.230890 0.248214 0.230892 0.249277 0.246472 0.244859 0.229837 0.248355 0.242755 0.238713
chargesum: 0.00000
title: Mulliken charges with hydrogens summed into heavy atoms:
elementType: S S S S P P O O O O C C C C C C C C C C C
charge: 0.021843 0.076969 -0.232793 -0.235768 0.604726 0.610117 -0.463066 -0.455211 -0.458610 -0.465947 0.510492 -0.207889 -0.125073 -0.112094 -0.227597 0.033970 0.129347 0.247934 0.247018 0.244164 0.257467
polarizability: 4.50314490e+02 7.03885791e+00 2.32335047e+02 5.27743321e+00 1.90000373e+00 2.02550488e+02
1716.lowfreq: -15.9677 -4.2335 0.0023 0.0027 0.0030 1.7287 11.0989 15.4316 19.0411
frequency: -12.2141 14.4381 18.4496 19.7308 34.3362 38.3150 45.9336 56.8145 58.7449 68.6237 76.0081 89.0830 113.6024 117.3900 118.9014 123.9684 130.2716 132.4964 136.5701 146.0304 150.4401 162.8947 179.7464 208.0406 225.4991 230.7716 266.8246 274.6998 284.3194 340.1634 344.8453 359.1618 364.2696 370.8732 374.6237 389.2470 403.9865 420.4477 506.1284 528.6870 536.9876 619.8428 624.1846 629.3714 638.0468 653.6431 672.3572 682.7047 736.1959 803.0577 839.9057 848.7526 896.1555 945.7844 955.1611 961.7207 968.2955 974.2182 985.3742 1002.4735 1068.3214 1099.0233 1106.2804 1112.9446 1116.4026 1116.4960 1123.5708 1124.5158 1125.7138 1132.2731 1139.6602 1189.2874 1221.3852 1242.4855 1298.3101 1375.1855 1398.6035 1416.4050 1423.1740 1423.8347 1426.2706 1453.0515 1454.1873 1454.2461 1456.2835 1463.7607 1469.1232 1469.4709 1470.4065 1471.1457 1474.9150 1571.0883 1597.7295 2977.7296 2977.8143 2979.6869 2987.1174 3048.0646 3077.8121 3078.1604 3080.7225 3094.5660 3125.2076 3128.7289 3131.1317 3131.3000 3132.2275 3132.6735 3135.9780 3161.0416 3176.8577
redmass: 4.5423 7.1311 6.2650 5.6739 4.0079 4.7158 4.4725 3.3684 3.8373 4.4290 4.7810 5.6183 5.3919 1.3541 1.1870 2.9063 1.2958 1.3718 2.5428 3.7116 5.3772 3.9785 6.6592 5.8955 6.2516 5.1522 8.0410 11.0964 6.9986 5.1427 5.2694 3.1906 5.3583 5.5758 10.3637 10.8204 2.8652 8.0344 3.6595 17.0443 17.9669 4.7929 6.5001 6.4026 10.9883 11.5904 12.6945 12.3824 3.5305 4.6191 1.2498 1.6700 1.5004 11.3636 10.8942 1.3703 9.7721 1.4085 11.5548 4.4903 2.8475 1.3383 1.2434 1.2458 1.2457 1.2472 1.2913 1.2935 1.2983 1.3031 1.0828 1.1107 2.7542 1.2339 1.2856 4.9928 3.1864 1.1212 1.1178 1.1169 1.1170 1.0496 1.0506 1.0480 1.0496 1.1167 1.0539 1.0538 1.0535 1.0649 2.3001 7.0296 6.1606 1.0303 1.0304 1.0307 1.0296 1.0582 1.1047 1.1050 1.1046 1.1047 1.1024 1.1067 1.1024 1.1021 1.0915 1.1038 1.0902 1.0962 1.0958
irintensity: 0.3947 0.5379 0.3743 0.5418 0.1180 0.3558 0.9503 5.2005 4.3752 0.5488 2.3302 4.9399 1.2296 0.0605 0.1078 2.0031 0.3745 1.9660 3.8592 2.3662 9.5771 5.0061 1.7225 2.1120 14.7111 0.8502 9.1148 14.5817 2.6569 17.4357 3.2304 4.2920 0.6026 0.8101 28.9730 32.8243 0.4549 21.6468 13.3443 309.1888 94.8474 15.5613 10.0492 5.2308 81.7571 66.0369 98.8731 111.9297 5.8281 11.2639 0.8021 33.8559 0.4055 158.5060 269.2778 0.3895 116.7410 0.8884 42.4844 11.9558 0.5948 8.0456 0.3688 0.0438 0.3171 0.1326 1.5539 0.8204 0.2197 0.2662 1.7256 2.9030 0.8706 14.4204 0.1157 0.2572 13.3304 1.7274 4.1498 5.3594 4.3584 5.5517 17.4893 21.6762 14.5353 17.9593 14.0145 10.2287 15.9216 15.9283 20.7240 0.1460 1.3859 12.4325 96.5993 26.0277 44.1615 7.8030 21.6746 22.0556 32.1616 19.8315 8.9274 0.7619 5.1799 12.6549 11.4624 11.0109 14.1011 7.1851 0.9203
temp: 298.150 k
press: 1.00000 atm
elementType: 16 16 16 16 15 15 8 8 8 8 6 6 6 6 6 6 6 6 6 6 6 1 1 1 1 1 1 1 1 1 1 1 1 1 1 1 1 1 1
symmnumber: 1
zpe: 735356.4 jmol-1
zpe.correction: 0.280082 hartree
zpe.thermalcorrener: 0.308122 hartree
zpe.thermalcorrenthalpy: 0.309066 hartree
zpe.thermalcorrgfe: 0.215552 hartree
zpe.sumelectzpe: -3003.903902 hartree
zpe.sumelectthermal: -3003.875863 hartree
zpe.sumelectthermalent: -3003.874918 hartree
zpe.sumelectthermalfe: -3003.968432 hartree
dipole: 1.9310 -0.6369 0.9260
dipole: 2.2343
quadrupole: -205.3638 -154.1722 -163.7405
quadrupole: -13.2533 -12.6766 -16.3077
quadrupole: -30.9383 20.2533 10.6849 -13.2533 -12.6766 -16.3077
hfenergy: -3004.1839843 hartree
pointgroup: C01 [X(C11H18O4P2S4)]
dipole: -0.734786 -0.4637995 0.1330242 debye
polarizability: 448.9229918|17.6728773|205.0662695|10.4714804|-5.7016739|231.2107645 unknown
InChI: InChI=1S/C7H6S2.2C2H6O2PS/c8-5-6-1-3-7(9)4-2-6;2*1-3-5(6)4-2/h1-4H,5H2;2*1-2H3
charge 0 multiplicity 1
39 atoms
S  -2.540355 -1.019238 -0.398479
S  3.992989 0.765322 1.62071
S  -5.750403 -1.263199 -2.162664
S  6.830156 0.011807 -0.647146
P  -4.763289 -0.482321 -0.527663
P  4.777182 0.126716 -0.451926
O  -4.780305 1.239563 -0.279752
O  -5.373416 -0.81823 1.065167
O  3.886009 -1.303111 -0.91383
O  3.898106 1.255912 -1.43036
C  -0.626849 0.154461 1.281637
C  -2.120872 -0.027022 1.214359
C  0.17491 -0.750935 2.024402
C  0.005361 1.230855 0.602581
C  2.183883 0.499116 1.420229
C  1.574698 -0.586601 2.092195
C  1.400538 1.411393 0.672801
C  -4.68768 2.092683 -1.485596
C  -5.806903 -2.20647 1.337689
C  4.441418 -2.626563 -0.562101
C  4.073925 1.158821 -2.902353
H  -2.518224 -0.612861 2.05529
H  -2.669588 0.923833 1.12935
H  -0.298173 -1.588295 2.550383
H  -0.602613 1.931817 0.019157
H  2.190822 -1.286813 2.664961
H  1.889025 2.238282 0.150516
H  -5.503755 1.859653 -2.192458
H  -4.792837 3.1178 -1.10124
H  -3.708907 1.967892 -1.985273
H  -6.578746 -2.525398 0.614261
H  -4.948318 -2.902942 1.305025
H  -6.226634 -2.165767 2.353388
H  3.835467 -3.344181 -1.135137
H  5.505769 -2.698253 -0.852677
H  4.33226 -2.818419 0.520765
H  3.667556 0.202896 -3.274189
H  3.499073 2.006062 -3.304169
H  5.14152 1.259134 -3.17075
