program: Gaussian 09
title: 000004692
version: EM64L-G09RevD.01
frameworkgroup: C1[X(C15H20O3)]
method: RPBEPBE
basis: SDD
operation: Freq
keyword: #pfreq=noraman
keyword: PBEPBE/SDD
title: #p freq=noraman PBEPBE/SDD
converged: YES YES NO NO
title: Mulliken charges:
elementType: O O O C C C C C C C C C C C C C C C H H H H H H H H H H H H H H H H H H H H
charge: -0.290895 -0.215478 -0.205025 0.432915 -0.184360 -0.139495 -0.192734 -0.483559 -0.803530 -0.472535 -0.444400 0.327394 -0.553976 0.082825 -0.367048 0.457679 -0.685645 -0.834277 0.239916 0.233198 0.257640 0.231171 0.201680 0.240731 0.230966 0.226614 0.234664 0.217843 0.211462 0.219314 0.222374 0.219262 0.215074 0.227487 0.261483 0.221056 0.232978 0.227232
chargesum: 0.00000
title: Mulliken charges with hydrogens summed into heavy atoms:
elementType: O O O C C C C C C C C C C C C C C C
charge: -0.290895 -0.215478 -0.205025 0.432915 0.055556 0.093702 0.064905 -0.050708 -0.105218 -0.020028 -0.013625 0.327394 -0.112340 0.082825 -0.151974 0.457679 -0.196675 -0.153012
polarizability: 2.01248042e+02 1.61079996e+01 1.66531570e+02 6.25187681e+00 9.26446268e+00 1.26565169e+02
1716.lowfreq: -12.2512 -8.6352 -0.0007 -0.0007 -0.0006 6.1432 42.4328 57.7653 86.3210
frequency: 42.4124 57.7590 86.2847 90.3746 106.1633 136.6222 169.1175 188.8109 194.5285 217.8324 221.9224 241.0624 273.4114 274.7525 295.8646 313.4416 332.7120 355.8270 382.5855 398.2352 410.7815 447.6634 468.2102 480.6331 544.3345 574.5258 589.7348 601.1747 641.7560 671.7030 694.0372 728.3117 745.9633 772.8608 780.8775 803.9824 819.4892 861.4219 864.4961 909.4631 925.3939 941.4014 950.4109 966.0790 978.7808 986.5317 996.0293 1018.0870 1033.8724 1038.1826 1053.4870 1063.7402 1073.4184 1086.3243 1111.3199 1117.0344 1162.1694 1183.2459 1191.1504 1213.2916 1224.1714 1244.2642 1252.6443 1266.4630 1272.3448 1298.1808 1310.3651 1317.9733 1333.0209 1335.6675 1343.5479 1353.5234 1374.5017 1391.1704 1397.7366 1417.6846 1426.9601 1454.7281 1463.3903 1464.6728 1466.7728 1472.2592 1478.2572 1480.0243 1491.4076 1668.3587 1682.1406 1684.1547 2959.3326 2968.7682 2971.6784 2984.2116 2990.2663 2993.2500 2998.9560 3027.4257 3028.4831 3041.1569 3057.8788 3062.5910 3066.8819 3074.2266 3076.5386 3080.4825 3082.7705 3095.4989 3095.5681 3204.4476
redmass: 3.9693 4.9310 3.3049 4.9378 4.2345 2.6934 1.6280 1.3620 2.2618 2.5215 2.6557 2.2655 3.3452 3.2071 2.4436 3.1976 4.0898 3.1664 2.5159 2.6285 4.6716 3.5539 3.3201 2.8999 3.3339 3.1466 3.1277 3.3654 2.7785 3.0949 3.1952 3.1370 3.2811 3.4687 2.3092 1.5952 2.2133 2.7055 2.0289 2.7233 2.3214 2.1825 2.0972 2.0653 1.5088 1.8897 1.7408 1.8879 3.0719 1.6574 1.9124 2.2488 1.8469 2.4047 2.0524 2.4685 1.5652 1.4475 1.2633 1.2740 1.7313 2.2964 1.4965 1.7379 1.8389 1.3418 1.3555 1.2913 1.3175 1.3610 1.3615 1.5732 1.5516 1.2457 1.2282 1.1765 2.0675 1.0673 1.1339 1.0733 1.0593 1.0683 1.0686 1.1438 1.0950 6.7672 6.9136 11.3275 1.0382 1.0664 1.0633 1.0365 1.0651 1.0673 1.0795 1.0960 1.0964 1.0997 1.0874 1.0959 1.0919 1.0984 1.0924 1.0917 1.0917 1.0643 1.0965 1.1154
irintensity: 1.4077 1.6573 0.5234 0.9415 0.1095 0.6401 0.9010 0.3917 0.3841 0.1507 3.3980 0.2727 1.1576 1.2102 1.3092 3.5889 3.7632 0.6128 3.4494 0.6662 2.2456 8.5901 8.9554 2.9618 8.0033 5.4309 4.4136 4.0684 6.0600 6.4575 1.1991 0.2613 9.4220 12.5178 8.4914 14.3917 15.5666 12.2349 11.7633 44.0440 39.0992 10.9090 19.7860 2.4078 46.1580 19.0357 24.0342 0.9355 143.7159 4.8553 9.5366 6.0286 28.1592 10.2659 3.0869 6.2987 4.7798 1.6805 15.6431 4.6952 5.0583 82.9068 4.4036 25.2215 5.5739 1.3731 0.1631 1.0057 0.6075 8.3852 1.9046 3.5454 0.5784 29.1201 15.0535 25.6487 12.2033 7.3555 7.6474 17.0968 4.1737 14.8012 7.6430 4.6458 23.7335 42.9433 8.8216 272.9860 33.7567 22.3272 24.3364 18.8956 26.9245 44.9403 19.1209 8.2555 31.6214 9.8244 5.7212 42.4095 15.2894 26.0894 5.8753 18.6212 78.1380 4.3538 22.5210 3.4407
temp: 298.150 k
press: 1.00000 atm
elementType: 8 8 8 6 6 6 6 6 6 6 6 6 6 6 6 6 6 6 1 1 1 1 1 1 1 1 1 1 1 1 1 1 1 1 1 1 1 1
symmnumber: 1
zpe: 832050.0 jmol-1
zpe.correction: 0.316911 hartree
zpe.thermalcorrener: 0.334417 hartree
zpe.thermalcorrenthalpy: 0.335361 hartree
zpe.thermalcorrgfe: 0.272702 hartree
zpe.sumelectzpe: -807.825068 hartree
zpe.sumelectthermal: -807.807563 hartree
zpe.sumelectthermalent: -807.806618 hartree
zpe.sumelectthermalfe: -807.869277 hartree
dipole: -5.4797 5.6584 1.3950
dipole: 7.9994
quadrupole: -122.8036 -115.9494 -103.1572
quadrupole: 13.7542 2.7974 -3.0380
quadrupole: -8.8335 -1.9793 10.8129 13.7542 2.7974 -3.0380
hfenergy: -808.1419793 hartree
pointgroup: C01 [X(C15H20O3)]
dipole: -2.2194614 -2.152721 -0.5871946 debye
polarizability: 200.282398|-16.9494611|167.1124117|-6.3844114|10.2241312|126.9499704 unknown
InChI: InChI=1S/C15H20O3/c1-9-5-4-8-15(3)13(18-15)12-11(7-6-9)10(2)14(16)17-12/h5,11-13H,2,4,6-8H2,1,3H3
charge 0 multiplicity 1
38 atoms
O  -0.599983 2.90517 0.257819
O  2.12535 1.336128 0.697401
O  4.301012 0.8319 0.037333
C  -1.561133 1.821415 -0.231476
C  -0.065735 1.63348 -0.341403
C  0.755917 0.734363 0.558144
C  0.953191 -0.700377 -0.039545
C  -2.380665 1.215261 0.90644
C  -2.325713 2.20825 -1.487046
C  0.569203 -1.841298 0.942917
C  -3.335285 0.045783 0.51007
C  2.423708 -0.72663 -0.422634
C  -0.959898 -1.947553 1.225467
C  3.100416 0.511464 0.088496
C  -2.794855 -1.107381 -0.334885
C  -1.805567 -2.000976 -0.040879
C  3.110419 -1.676935 -1.103865
C  -1.499504 -3.151718 -0.988821
H  0.382652 1.778179 -1.337257
H  0.347481 0.718732 1.580885
H  0.319037 -0.800021 -0.941042
H  -3.007367 2.030083 1.322069
H  -1.709829 0.913094 1.727779
H  -1.682032 2.791244 -2.167258
H  -2.681995 1.3108 -2.025089
H  -3.203633 2.829975 -1.232398
H  1.111226 -1.70602 1.899124
H  0.928633 -2.796002 0.513896
H  -4.193688 0.479054 -0.036004
H  -3.757185 -0.355754 1.454636
H  -1.284341 -1.11501 1.872513
H  -1.120907 -2.876282 1.811882
H  -3.330507 -1.267309 -1.283533
H  2.632888 -2.585118 -1.488817
H  4.183013 -1.545512 -1.287132
H  -0.468847 -3.098966 -1.392408
H  -2.194129 -3.167732 -1.846287
H  -1.581146 -4.12478 -0.464792
