program: Gaussian 09
title: 000004690
version: EM64L-G09RevD.01
frameworkgroup: C1[X(C9H6Cl2N2O3)]
method: RPBEPBE
basis: SDD
operation: Freq
keyword: #p
keyword: freq=noraman
keyword: PBEPBE/SDD
title: #p freq=noraman PBEPBE/SDD
converged: NO YES NO NO
title: Mulliken charges:
elementType: Cl Cl O O O N N C C C C C C C C C H H H H H H
charge: 0.000835 0.002541 -0.176781 -0.229333 -0.192739 -0.202894 -0.238528 0.484273 0.298087 0.261651 -0.387563 -0.360679 -0.592120 -0.022401 -0.174158 -0.125239 0.303909 0.301996 0.263475 0.261721 0.261340 0.262608
chargesum: 0.00000
title: Mulliken charges with hydrogens summed into heavy atoms:
elementType: Cl Cl O O O N N C C C C C C C C C
charge: 0.000835 0.002541 -0.176781 -0.229333 -0.192739 -0.202894 -0.238528 0.484273 0.298087 0.261651 -0.083654 -0.058683 0.194416 -0.022401 0.088450 -0.125239
polarizability: 2.36915261e+02 1.21275926e+00 1.51328870e+02 6.71091218e-02 -8.45665330e-03 5.67936010e+01
1716.lowfreq: -57.3819 -6.3682 -5.2041 -2.0642 -0.0029 -0.0023 -0.0013 31.1358 37.4314
frequency: -57.3410 31.1289 37.4198 90.0740 106.5787 140.7130 176.3063 178.5912 226.1057 234.2270 243.3906 259.7460 261.2415 332.1347 364.6986 393.0758 436.5873 439.9010 505.6721 567.6234 594.0575 636.3841 649.4608 662.8589 688.7840 696.0116 701.6176 713.1377 824.5382 825.5844 880.4954 959.4726 963.8127 995.1553 1000.2294 1022.9655 1122.6387 1135.2075 1144.9979 1156.1542 1246.4364 1252.1415 1339.6843 1354.9658 1375.2142 1411.0050 1443.2190 1467.4560 1467.9468 1484.5218 1564.7686 1599.2576 1666.8213 1766.5077 3013.6745 3110.9503 3133.1047 3168.3894 3193.9891 3197.5440
redmass: 1.0285 10.7402 6.9296 9.1686 6.7744 6.6620 6.8564 25.8380 7.6689 5.6544 14.3723 10.9953 4.1848 8.0188 10.9752 9.0848 6.4464 3.2037 8.9707 5.3403 10.1656 12.3378 7.9907 7.8137 4.2262 7.9551 12.1195 9.0070 8.0637 1.3324 1.4790 8.9503 1.3137 2.9535 4.5690 6.1363 2.1954 1.3051 5.6011 1.3760 2.7501 1.3897 4.4732 5.4496 6.7693 3.7100 1.2437 2.9418 1.0731 1.0709 8.9063 6.5368 11.2456 11.8319 1.0330 1.1033 1.1025 1.0905 1.0961 1.0931
irintensity: 0.0242 0.0273 0.1656 0.0150 3.1812 7.4948 0.6693 0.1019 0.4250 0.0670 0.6303 0.2623 3.5580 1.6881 19.6313 5.0490 3.8839 8.7511 21.7411 3.8681 33.3114 0.3422 16.2835 2.6084 1.4054 28.9361 22.2747 8.1186 31.2143 39.4648 37.9969 73.8260 1.3172 63.2496 2.5336 39.3570 48.0581 0.2469 41.4267 1.8337 60.2779 1.2576 3.3377 357.0501 36.7439 42.4891 141.2771 304.4746 36.5047 5.1573 16.3164 66.1709 463.9772 465.1081 21.8018 11.6665 0.9281 0.9017 4.6055 2.5619
temp: 298.150 k
press: 1.00000 atm
elementType: 17 17 8 8 8 7 7 6 6 6 6 6 6 6 6 6 1 1 1 1 1 1
symmnumber: 1
zpe: 368787.0 jmol-1
zpe.correction: 0.140464 hartree
zpe.thermalcorrener: 0.154415 hartree
zpe.thermalcorrenthalpy: 0.155359 hartree
zpe.thermalcorrgfe: 0.097843 hartree
zpe.sumelectzpe: -1600.686953 hartree
zpe.sumelectthermal: -1600.673002 hartree
zpe.sumelectthermalent: -1600.672057 hartree
zpe.sumelectthermalfe: -1600.729573 hartree
dipole: 2.7406 -2.2681 0.0007
dipole: 3.5574
quadrupole: -101.0361 -113.8587 -105.3980
quadrupole: -5.5377 0.0195 -0.0027
quadrupole: 5.7282 -7.0944 1.3663 -5.5377 0.0195 -0.0027
hfenergy: -1600.8274163 hartree
pointgroup: C01 [X(C9H6Cl2N2O3)]
dipole: 1.0161558 -0.9624439 -0.0004937 debye
dipolederiv: -0.2733375 0.2615584 0.0003573 0.3603823 -0.521325 -0.0006182 0.000502 -0.0006454 -0.0282472 -0.8462757 -0.0778374 0.0006789 -0.1003472 -0.0626161 0.0000615 0.0008761 0.0000545 -0.02312 -1.1508648 -0.1844543 -0.0010537 0.2139897 -0.3079462 -0.0000919 0.0014266 0.0008714 -0.0964604 -0.5494577 -0.0139421 -0.0003423 0.3571416 -1.1075092 -0.0020005 -0.0007558 0.0016625 -0.3358044 -1.0297107 -0.4469532 0.0009804 -0.6325144 -0.9323467 0.0016224 -0.0023703 -0.0021164 -0.3259933 -1.6246696 0.3718251 -0.0000626 0.7088804 -0.1923074 0.0006434 0.0000002 -0.0006837 -0.0920364 -1.1597725 -0.1664874 -0.0026318 -0.5315969 -1.1339887 0.001343 0.0007392 -0.0012131 -0.2068212 1.5134247 -0.0275952 -0.0005888 -0.0367636 0.0270908 -0.0000689 -0.0012218 -0.0003061 0.1041457 1.8774755 0.0722091 0.0012558 -0.5117563 1.5642343 0.0024428 0.0025503 -0.0000888 0.3041253 1.7678974 0.5707926 0.0000624 0.6163672 1.7387548 -0.0027819 0.001147 0.000609 0.3332223 -0.3501576 0.1129063 0.0001055 0.2259563 -0.2051689 -0.000205 0.0006436 -0.0002092 -0.1282996 -0.3359475 0.0177679 -0.0000661 -0.1009191 -0.0432209 0.0001409 0.000187 0.0001321 -0.1636252 0.4894665 -0.1981699 0.0050586 -0.2423768 0.1717283 -0.0024991 0.0061356 -0.0013899 0.2109977 0.262542 -0.4772057 -0.0005091 -0.5726071 0.8560132 0.0010263 -0.0007068 0.0012134 -0.0279004 -0.0851674 -0.0826717 0.0000294 0.0205518 0.0703248 0.000059 -0.0000136 0.000166 -0.0720058 1.0358993 0.2715573 -0.00099 0.2263645 -0.199191 -0.0002438 -0.0011114 -0.0003793 -0.0721651 0.1154411 -0.0344611 0.0000865 -0.0420487 0.0701216 -0.0000653 -0.0000009 -0.0000537 0.1855294 0.1238979 0.0535701 0.0001939 0.0243555 0.0802989 -0.0000856 0.0001934 -0.0001404 0.1846282 0.0506428 -0.017346 0.001711 -0.1206759 0.031958 0.0061024 0.0009422 0.0039366 0.1388871 0.0642131 0.0150704 -0.03121 0.0900115 0.0425332 -0.0844808 0.0245728 -0.0831946 -0.0182316 0.0568659 0.0208974 0.0268662 0.0899965 0.0493151 0.0797642 -0.0338081 0.0818372 -0.0309961 0.0475946 -0.0410308 0.0000688 -0.0423912 0.0032472 -0.0000647 0.0000727 -0.000062 0.1601709 unknown
polarizability: 236.6943395|-4.5090944|151.5498117|-0.0110456|0.0223721|56.793581 unknown
InChI: InChI=1S/C9H6Cl2N2O3/c1-12-8(14)13(16-9(12)15)5-2-3-6(10)7(11)4-5/h2-4H,1H3
charge 0 multiplicity 1
22 atoms
Cl -3.666667 2.417253 0.003391
Cl -5.138812 -0.527905 0.00311
O  1.455963 1.250486 -0.002893
O  1.7909 -2.312257 -0.002658
O  3.684738 2.01516 -0.00086
N  0.885466 -0.101956 -0.002943
N  3.108973 -0.311214 -0.001679
C  -0.525946 -0.195394 -0.001709
C  1.902139 -1.063471 -0.00437
C  2.896607 1.064731 -0.003632
C  -1.300934 0.989052 -0.000108
C  -1.147186 -1.474076 -0.001919
C  4.437116 -0.936202 0.004249
C  -2.704197 0.885613 0.001291
C  -2.551891 -1.546878 -0.000458
C  -3.337077 -0.374683 0.001168
H  -0.822658 1.970007 0.000039
H  -0.54073 -2.381861 -0.003251
H  5.189815 -0.133554 -0.02727
H  4.551386 -1.590115 -0.875305
H  4.571881 -1.537112 0.918293
H  -3.046485 -2.522224 -0.000589
