program: Orca
programVersion: 5.0.3
elementType: C C H H O O N H H H
charge: 0
multiplicity: 1
keywords: PBE D3BJ def2-TZVP opt freq #tightscf is default in the opt. Here you say method, basis set and type of calculation
frequency: 0.00 0.00 0.00 0.00 0.00 0.00 60.20 260.88 315.96 491.01 528.38 634.88 790.90 856.79 897.41 906.52 1045.69 1122.16 1174.50 1277.66 1305.33 1392.66 1410.28 1607.51 1793.03 2993.07 3039.37 3180.50 3444.39 3525.05
frequency: 60.20 260.88 315.96 491.01 528.38 634.88 790.90 856.79 897.41 906.52 1045.69 1122.16 1174.50 1277.66 1305.33 1392.66 1410.28 1607.51 1793.03 2993.07 3039.37 3180.50 3444.39 3525.05
formula: C2H5NO2
InChI: InChI=1/C2H5NO2/c3-1-2(4)5/h4H,1,3H2
10 atoms
C  4.414468 8.039927 -2.420295
C  5.387865 6.85192 -2.518326
H  4.989553 8.887289 -2.020653
H  4.117997 8.315436 -3.442904
O  6.337215 6.838293 -3.269021
O  5.078396 5.849616 -1.675101
N  3.280421 7.721563 -1.539141
H  2.423676 7.553104 -2.064878
H  4.24762 6.182615 -1.220716
H  3.093047 8.460084 -0.863498
totalener: -284.23270938 hartree
nucrepener: 178.95282293 hartree
electener: -463.18553231 hartree
oneelecener: -742.35311825 hartree
twoeener: 279.16758594 hartree
kineticenergy: 282.85326022 hartree
exchangeener: -35.086915776381 hartree
correlationener: -1.337788521533 hartree
xcener: -36.424704297914 hartree
dispersion: -0.006448627 hartree
dispersion: -0.006489334 hartree
dispersion: -0.006482946 hartree
dispersion: -0.006479562 hartree
dispersion: -0.006480337 hartree
dispersion: -0.006479706 hartree
dispersion: -0.006477933 hartree
dispersion: -0.006476835 hartree
dispersion: -0.006475209 hartree
dispersion: -0.006475113 hartree
energy: -511.0468 -509.5092 -381.3861 -271.9839 -270.4687 -27.1802 -25.0869 -22.9543 -17.8299 -14.4454 -13.4182 -12.7638 -12.1779 -10.9421 -10.2613 -9.3712 -8.8684 -7.3149 -7.2734 -5.8922 -0.8005 -0.5103 0.9488 1.1531 1.8061 2.9410 3.1925 3.5968 4.2408 5.2341 5.3212 6.3290 6.7983 7.0718 7.8500 8.0687 8.7918 9.4362 9.7732 9.9552 10.3547 10.6268 11.5668 11.9647 12.1196 12.7832 13.0729 13.6096 13.8799 15.2733 15.8984 16.4207 17.8241 18.3293 20.3474 20.6925 22.1820 23.4128 23.9062 24.7507 25.4339 26.9982 27.2157 29.0720 30.5647 31.7314 33.7176 33.9130 34.5366 35.3814 36.1108 36.6934 37.4019 39.8121 40.0506 41.5014 42.5092 43.3680 44.4291 45.0953 46.3367 46.8489 47.4097 48.8063 49.2515 49.8243 50.4505 50.8330 51.3754 52.4988 53.5834 54.5043 56.0738 57.2124 57.8532 58.4121 59.3247 60.6144 61.3341 62.8748 64.0095 64.9295 65.8314 66.3907 67.9296 68.5608 69.3250 70.3174 70.8444 72.1505 73.6985 76.3460 76.6970 77.9586 78.0599 78.6381 79.6396 80.6639 81.9198 83.4714 84.1432 84.5172 86.0354 86.8702 87.2509 87.5087 88.7627 89.7412 91.0199 91.7572 94.6244 94.9076 99.1826 100.0460 101.2021 101.7257 103.5139 107.3205 109.4542 111.3649 114.1514 115.5062 115.6952 118.3713 118.8177 123.1671 125.7016 126.0322 129.5908 129.9055 133.2453 135.4426 137.3264 137.6605 138.3223 139.3020 139.4614 142.1937 144.9117 145.6131 146.7618 149.5505 150.7224 153.7619 157.7454 160.6176 163.5951 163.8488 169.0814 170.1661 171.9647 172.6543 177.8890 179.2656 180.8415 182.2884 186.7947 189.1927 191.0759 193.7186 600.8382 624.5261 858.6405 1180.6886 1182.3355 electronvolt
chargesum: 0.0000000
charge: -0.175038 0.207233 0.137082 0.137661 -0.278475 -0.295929 -0.523086 0.237749 0.316234 0.236569
charge: -0.316280 -0.552451 0.149144 0.142467 0.115265 0.108549 -0.148892 0.159247 0.184895 0.158057
qa: -0.1750 0.2072 0.1371 0.1377 -0.2785 -0.2959 -0.5231 0.2377 0.3162 0.2366
va: 3.8233 4.3428 0.9744 0.9781 2.2357 2.1311 2.9600 0.9410 0.9513 0.9436
dispersion: -0.006474888 hartree
energy: -284.243069971657 hartree
dipole: -5.10890 3.30980 -1.79910 3.84294 -2.68903 1.15391 1.58172 -0.94629 0.63542
magnitude: 2.22980 au
magnitude: 5.66770 debye
temp: 298.15 k
press: 1.00 atm
zeropoint: 0.07758100 hartree
thermalvibcorrection: 0.00262894 hartree
thermalrotcorrection: 0.00141627 hartree
thermaltrasncorrection: 0.00141627 hartree
thermaltotal: -284.16002749 hartree
thermalcorr: 0.00546149 hartree
nonthermalcorr: 0.07758100 hartree
totalcorr: 0.08304249 hartree
thermalcorrenthalpy: 0.00094421 hartree
totalenthalpy: -284.15908328 hartree
vibrat: 0.00431979 hartree
rotat: 0.01205383 hartree
transl: 0.01846507 hartree
total: 0.03483868 hartree
totalentropycorr: -0.03483868 hartree
gibbsenthalpy: -284.19392196 hartree
gibbsminuselec: 0.04914801 hartree
