program: Orca
programVersion: 5.0.3
elementType: C C H H O O
charge: 0
multiplicity: 1
keywords: PBE D3BJ def2-TZVP opt freq #tightscf is default in the opt. Here you say method, basis set and type of calculation
frequency: 0.00 0.00 0.00 0.00 0.00 0.00 477.44 517.96 698.52 911.47 959.80 1030.13 1080.69 1146.81 1428.67 1953.04 3044.14 3142.56
frequency: 477.44 517.96 698.52 911.47 959.80 1030.13 1080.69 1146.81 1428.67 1953.04 3044.14 3142.56
formula: C2H2O2
InChI: InChI=1/C2H2O2/c3-2-1-4-2/h1H2
6 atoms
C  5.102879 8.049314 -3.052781
C  5.884808 6.829398 -2.936939
H  5.394474 8.953395 -2.513049
H  4.366046 8.167138 -3.850837
O  6.789967 6.097379 -3.202503
O  4.811242 6.858236 -2.128737
totalener: -227.63202901 hartree
nucrepener: 105.05125942 hartree
electener: -332.68328843 hartree
oneelecener: -518.52134180 hartree
twoeener: 185.83805337 hartree
kineticenergy: 226.52306960 hartree
exchangeener: -27.365236797358 hartree
correlationener: -0.991716843990 hartree
xcener: -28.356953641348 hartree
dispersion: -0.003100856 hartree
dispersion: -0.002964072 hartree
dispersion: -0.002867292 hartree
dispersion: -0.002862152 hartree
dispersion: -0.002852422 hartree
dispersion: -0.002845736 hartree
dispersion: -0.002840645 hartree
dispersion: -0.002843571 hartree
dispersion: -0.002849197 hartree
dispersion: -0.002845647 hartree
dispersion: -0.002845629 hartree
dispersion: -0.002845583 hartree
energy: -512.1987 -510.7650 -272.9259 -271.5043 -28.6024 -26.4875 -17.8876 -14.5937 -13.0843 -12.2474 -11.3765 -9.9736 -9.7737 -8.0004 -6.7752 -1.4127 -0.9224 0.4520 1.9920 2.4734 3.1232 4.1671 5.2997 5.5157 6.3602 6.6167 6.8951 8.5478 8.6454 10.3097 10.4971 10.5960 11.5275 11.5484 13.7413 14.3753 15.6748 16.8781 16.9432 19.7821 20.2859 20.7013 21.9590 22.9087 23.7548 24.8041 26.8752 28.9245 31.2777 32.4908 35.4599 36.0957 36.9126 37.7131 39.7886 40.0450 40.7833 40.7919 43.3688 45.0552 47.8158 48.1443 49.3046 50.6826 51.7709 53.9784 54.4939 55.6762 57.6317 57.8111 60.5190 62.2990 63.6731 63.6792 66.4660 67.1396 68.3523 69.8415 71.3546 73.6297 73.8280 75.4020 76.3678 77.6393 78.2129 79.5419 80.6885 81.3591 81.4735 82.1704 86.1163 86.4824 88.7001 90.0079 90.6407 91.3355 92.1038 98.4308 98.7682 100.2249 107.6276 107.8333 110.1390 112.2936 116.5160 118.6485 126.0770 129.7863 136.3875 137.0442 139.1361 141.4129 144.3371 146.4918 147.1020 153.2494 156.9410 158.3807 159.8829 168.2593 168.9679 170.4802 171.7496 173.2319 173.7192 179.0575 179.4208 182.5684 182.9556 186.6224 190.7112 193.9077 595.8034 629.6429 1180.3043 1183.2505 electronvolt
chargesum: -0.0000000
charge: -0.139236 0.245502 0.145170 0.145144 -0.213506 -0.183075
charge: -0.172448 -0.495555 0.131418 0.131417 0.162770 0.242398
qa: -0.1392 0.2455 0.1452 0.1451 -0.2135 -0.1831
va: 3.8350 4.3346 0.9568 0.9568 2.2984 2.1856
dispersion: -0.002845540 hartree
energy: -227.665080072595 hartree
dipole: -1.42396 0.85863 -0.56533 3.01100 -1.93619 1.07480 -0.67488 0.47782 -0.19706
magnitude: 1.23030 au
magnitude: 3.12717 debye
temp: 298.15 k
press: 1.00 atm
zeropoint: 0.03734200 hartree
thermalvibcorrection: 0.00074824 hartree
thermalrotcorrection: 0.00141627 hartree
thermaltrasncorrection: 0.00141627 hartree
thermaltotal: -227.62415728 hartree
thermalcorr: 0.00358079 hartree
nonthermalcorr: 0.03734200 hartree
totalcorr: 0.04092279 hartree
thermalcorrenthalpy: 0.00094421 hartree
totalenthalpy: -227.62321307 hartree
vibrat: 0.00100007 hartree
rotat: 0.01096231 hartree
transl: 0.01810064 hartree
total: 0.03006302 hartree
totalentropycorr: -0.03006302 hartree
gibbsenthalpy: -227.65327609 hartree
gibbsminuselec: 0.01180398 hartree
