program: Orca
programVersion: 5.0.3
elementType: C C H H O O
charge: 0
multiplicity: 1
keywords: PBE0 D3BJ def2-TZVP
formula: C2H2O2
InChI: InChI=1/C2H2O2/c3-2-1-4-2/h1H2
6 atoms
C  5.102879 8.049314 -3.052781
C  5.884808 6.829398 -2.936939
H  5.394474 8.953395 -2.513049
H  4.366046 8.167138 -3.850837
O  6.789967 6.097379 -3.202503
O  4.811242 6.858236 -2.128737
totalener: -227.65369241 hartree
nucrepener: 109.29236243 hartree
electener: -336.94605484 hartree
oneelecener: -526.65226474 hartree
twoeener: 189.70620990 hartree
kineticenergy: 226.60137646 hartree
exchangeener: -20.594482501719 hartree
correlationener: -1.007705737304 hartree
xcener: -21.602188239023 hartree
energy: -524.6872 -523.2523 -282.5211 -280.9281 -31.8678 -29.6760 -20.3761 -16.7514 -14.9678 -14.1739 -13.3420 -11.6040 -11.3960 -9.5848 -8.3615 -0.2700 0.2189 1.2655 2.8125 3.3399 4.0205 5.2991 6.2339 6.4264 7.5418 7.6835 8.2272 9.4761 9.6323 11.5476 11.6038 11.8374 12.6171 12.8431 15.1886 15.6737 16.9970 18.1262 18.3757 21.0122 21.6685 22.1164 23.3169 24.3326 25.4269 26.2595 28.5478 30.5797 33.2036 34.2079 37.5872 37.8149 38.9264 39.7622 41.7806 42.0791 42.7177 42.8216 45.4303 47.0373 49.9970 50.3168 51.4211 52.9208 53.9328 56.1452 56.7584 57.9052 59.9031 60.2284 62.9175 64.6502 66.0156 66.1281 69.2252 69.9481 70.7143 72.3485 73.7301 76.0489 76.3314 78.2526 79.1371 80.3394 80.7286 82.0047 83.6456 84.1543 84.1913 84.8221 88.7392 88.9839 91.5167 92.5502 93.3141 93.9962 94.7757 101.2787 101.4698 102.8676 110.5716 110.5811 113.0647 115.0586 119.5229 121.6714 129.4265 133.0876 139.9011 140.5455 142.6694 144.9307 147.9041 150.0907 150.7219 156.8618 160.6622 162.1294 163.6181 172.3580 173.1484 174.3109 175.8520 177.4027 177.7151 183.0775 183.3338 186.6511 187.1656 190.7913 194.8976 197.9938 604.9438 638.7681 1193.6110 1196.5705 electronvolt
chargesum: 0.0000000
charge: -0.129605 0.306970 0.154528 0.154538 -0.263181 -0.223250
charge: -0.159933 -0.467389 0.133631 0.133631 0.142338 0.217722
qa: -0.1296 0.3070 0.1545 0.1545 -0.2632 -0.2233
va: 3.8350 4.3190 0.9573 0.9573 2.2357 2.1425
dispersion: -0.002347055 hartree
energy: -227.656039466942 hartree
dipole: -1.42396 0.84269 -0.58126 3.01100 -1.86002 1.15097 -0.67488 0.44531 -0.22957
magnitude: 1.30970 au
magnitude: 3.32899 debye
