program: Gaussian 09
title: 000075895
version: EM64L-G09RevD.01
frameworkgroup: C1[X(C4H3N5O)]
method: RPBEPBE
basis: SDD
operation: Freq
keyword: #pfreq=noraman
keyword: PBEPBE/SDD
title: #p freq=noraman PBEPBE/SDD
converged: YES YES NO NO
title: Mulliken charges:
elementType: O N N N N N C C C C H H H
charge: -0.199917 -0.305728 -0.260618 0.059118 -0.049512 -0.011967 0.145629 -0.095863 0.066027 -0.326462 0.358032 0.373681 0.247580
chargesum: 0.00000
title: Mulliken charges with hydrogens summed into heavy atoms:
elementType: O N N N N N C C C C
charge: -0.199917 0.052304 0.113063 0.059118 -0.049512 -0.011967 0.145629 -0.095863 0.066027 -0.078882
polarizability: 1.15891683e+02 1.21278846e+00 9.19692371e+01 -5.69124811e-02 -1.27103015e-01 3.22586289e+01
1716.lowfreq: -8.0050 -4.5647 -0.0009 -0.0008 -0.0006 4.6792 101.5345 162.3073 222.7160
frequency: 101.5339 162.3068 222.7160 291.9583 304.6443 466.6232 479.4633 488.2623 511.0093 590.8319 597.1548 678.1074 687.8147 799.8191 833.2846 902.8626 945.1752 970.2546 1038.7515 1080.9152 1125.6341 1236.4329 1311.2716 1317.3445 1369.4291 1372.6609 1404.4408 1452.9392 1564.0269 1602.3714 3148.7864 3582.2354 3611.5910
redmass: 10.6040 2.3610 4.3671 2.6393 9.6636 2.3032 11.6760 1.4078 6.5580 4.0711 8.9980 10.5751 9.1378 11.7970 8.8950 9.1667 1.5095 9.0252 2.5018 5.2548 5.1728 8.0625 8.5011 1.7950 1.3479 3.3087 2.5637 3.4212 9.1837 9.7043 1.0919 1.0838 1.0845
irintensity: 1.4128 49.5213 23.9552 21.9129 1.9790 43.7945 0.7298 197.0192 7.0002 52.6082 3.0758 5.5032 6.5072 3.8140 5.9478 8.7828 10.0384 34.9227 55.2009 55.4820 91.3259 15.7354 23.0896 35.3182 49.1669 2.9292 228.4679 72.3941 213.4891 363.2910 22.3023 119.2359 277.8035
temp: 298.150 k
press: 1.00000 atm
elementType: 8 7 7 7 7 7 6 6 6 6 1 1 1
symmnumber: 1
zpe: 216839.0 jmol-1
zpe.correction: 0.082590 hartree
zpe.thermalcorrener: 0.090093 hartree
zpe.thermalcorrenthalpy: 0.091037 hartree
zpe.thermalcorrgfe: 0.050223 hartree
zpe.sumelectzpe: -502.419738 hartree
zpe.sumelectthermal: -502.412234 hartree
zpe.sumelectthermalent: -502.411290 hartree
zpe.sumelectthermalfe: -502.452104 hartree
dipole: 10.0005 2.9591 0.1063
dipole: 10.4296
quadrupole: -44.3253 -67.0368 -56.5543
quadrupole: -5.6227 0.4699 -0.5324
quadrupole: 11.6468 -11.0646 -0.5821 -5.6227 0.4699 -0.5324
hfenergy: -502.5023277 hartree
pointgroup: C01 [X(C4H3N5O1)]
dipole: 3.9026265 1.2505457 0.2072028 debye
dipolederiv: -0.5057133 -0.2119713 -0.0013481 -0.3486486 -1.0343703 -0.0013464 -0.002823 0.0067561 -0.349059 -0.4940867 0.0726257 -0.082109 -0.6484839 -0.3326957 -0.0312165 -0.190814 -0.0183826 -0.2703605 -1.1359571 0.1811768 0.0353394 0.2815595 0.4187125 0.0254306 0.2797825 -0.0288328 -0.1942286 0.7581666 -0.1170122 -0.0151269 0.1675461 -0.1799699 -0.0053483 -0.0204584 0.0220335 -0.0911148 -1.4670306 -0.0060703 -0.0682727 0.5128189 -0.5820215 0.0356232 -0.0818291 0.0101215 -0.2424915 -0.4276569 0.1690874 -0.0144236 -0.4698504 -1.1841337 -0.0069702 0.0024893 0.0316401 -0.2513898 0.8451434 -0.2978476 0.0703786 -0.9905045 0.5049873 -0.0504437 0.0540693 -0.0256196 0.2067478 -0.494538 -0.1420342 -0.008318 0.6179221 -0.3433341 0.0292384 -0.0579842 0.006751 0.0733424 0.7840416 0.0595602 0.0198582 0.3284273 1.5082944 -0.01219 0.0254552 -0.032402 0.2328744 1.3820735 0.2075703 0.0738565 0.4464666 0.7875288 0.006247 0.0730843 -0.0064188 -0.0262926 0.2925863 0.0665322 0.0055896 0.1195433 0.2444766 0.0083932 0.0482973 0.0161329 0.4116885 0.4323372 -0.0593662 -0.0085182 -0.1200697 0.2319341 -0.0065147 -0.1217884 0.0098744 0.3841126 0.030634 0.0777494 -0.0069058 0.1032732 -0.0394085 0.0090975 -0.0074809 0.0083462 0.116171 unknown
polarizability: 115.6354239|1.7983279|92.0022231|3.9994207|-1.2902476|32.4819023 unknown
InChI: InChI=1S/C4H3N5O/c10-4-2-3(5-1-6-4)8-9-7-2/h1,8-9H
charge 0 multiplicity 1
13 atoms
O  -1.723309 -2.037545 0.005337
N  2.000795 0.79638 0.144194
N  2.363359 -0.558069 0.139005
N  1.286819 -1.382178 0.135592
N  -0.178941 1.91439 -0.000307
N  -2.072229 0.302751 -0.067029
C  0.612643 0.840534 0.069424
C  0.202509 -0.55634 0.074456
C  -1.25169 -0.867508 0.003663
C  -1.531994 1.526387 -0.066422
H  2.681476 1.554019 0.078401
H  3.307715 -0.885467 0.337548
H  -2.228752 2.370247 -0.126163
