program: Gaussian 09
title: 000075871
version: EM64L-G09RevD.01
frameworkgroup: C1[X(C12H12N2O)]
method: RPBEPBE
basis: SDD
operation: Freq
keyword: #p
keyword: freq=noraman
keyword: PBEPBE/SDD
title: #p freq=noraman PBEPBE/SDD
converged: YES YES NO NO
title: Mulliken charges:
elementType: O N N C C C C C C C C C C C C H H H H H H H H H H H H
charge: -0.315049 -0.706235 -0.701337 0.373046 0.311808 -0.544523 0.522596 -0.334887 -0.364463 -0.436095 0.500322 -0.400297 -0.392353 -0.452549 -0.157726 0.253817 0.259750 0.250699 0.251514 0.217202 0.217358 0.214040 0.218308 0.303358 0.304769 0.303466 0.303461
chargesum: 0.00000
title: Mulliken charges with hydrogens summed into heavy atoms:
elementType: O N N C C C C C C C C C C C C
charge: -0.315049 -0.098108 -0.094410 0.373046 0.311808 -0.290706 0.522596 -0.075137 -0.113764 -0.184581 0.500322 -0.183095 -0.174995 -0.238509 0.060582
polarizability: 2.22851308e+02 1.29776237e+01 1.37252367e+02 -1.14420697e+01 4.95215600e+00 9.56441907e+01
1716.lowfreq: 0.0006 0.0007 0.0009 4.0789 5.4571 12.2304 23.2646 42.6052 59.3982
frequency: 23.1991 42.5990 59.3841 147.6949 198.0615 218.9464 263.5541 296.7433 326.0096 333.3081 338.7468 353.6921 366.7089 390.7069 412.9455 415.4463 449.7433 498.9239 520.0509 527.4191 576.2151 608.3158 637.5581 684.6606 692.1981 723.0705 771.7761 785.2645 805.5785 822.7076 834.0598 847.4920 855.0913 930.6659 944.6178 947.3468 953.8754 978.0189 995.5945 1015.0249 1034.5288 1090.0310 1120.4531 1134.0846 1164.9762 1174.1649 1199.5591 1292.0406 1299.8195 1311.4278 1324.2373 1378.3551 1397.4853 1433.5072 1458.1315 1490.5861 1504.7685 1585.5811 1598.3641 1623.0715 1630.2343 1639.4410 1644.5433 3121.3885 3121.5171 3125.5057 3141.8772 3145.6394 3156.4843 3165.2362 3178.1488 3569.6603 3570.8185 3710.8770 3711.0231
redmass: 4.5262 4.0707 4.8719 4.9078 4.5880 3.4763 4.8326 4.8099 1.2952 1.2537 4.2117 1.0489 1.0451 3.2868 3.2625 2.7704 2.7927 2.9242 6.6295 6.5723 4.3631 4.4690 6.8140 1.9484 4.0608 4.0369 1.4789 5.4146 1.2795 1.8414 5.2691 1.5038 1.7452 1.4175 1.5658 2.0073 1.3127 6.0290 2.7588 1.4265 1.5744 1.3981 1.1964 1.8302 1.1862 1.2315 2.5296 1.4650 1.3645 3.0799 2.5667 5.7170 8.4472 3.5370 3.0973 3.1469 3.0651 7.2035 6.7443 4.1573 2.4921 1.2851 1.6294 1.0887 1.0871 1.0890 1.0915 1.0939 1.0952 1.0955 1.0961 1.0447 1.0449 1.1040 1.1041
irintensity: 1.9792 0.1906 1.0549 2.6371 2.0405 8.5792 1.4718 2.8100 261.1837 294.2107 57.9349 0.8290 0.0184 0.7547 7.5671 0.6515 5.6784 19.1516 0.7872 0.7658 4.8065 3.5314 0.4395 28.1604 1.0605 2.6174 55.9547 22.8426 2.2199 84.4580 8.4634 2.1852 39.9594 5.4023 16.8915 36.6943 1.9572 4.7044 5.8925 0.0618 17.9647 16.8214 23.3486 50.8206 37.2149 12.0893 334.5986 45.1914 11.0512 27.7396 40.9073 5.1436 15.7465 2.2550 46.1262 177.8014 270.6612 17.1924 104.1488 148.0378 0.4475 233.9074 230.4589 14.2393 16.3202 34.2163 18.7965 20.4717 8.9292 3.8826 6.1507 53.5858 75.7416 20.2692 17.8594
temp: 298.150 k
press: 1.00000 atm
elementType: 8 7 7 6 6 6 6 6 6 6 6 6 6 6 6 1 1 1 1 1 1 1 1 1 1 1 1
symmnumber: 1
zpe: 561291.3 jmol-1
zpe.correction: 0.213785 hartree
zpe.thermalcorrener: 0.227344 hartree
zpe.thermalcorrenthalpy: 0.228288 hartree
zpe.thermalcorrgfe: 0.172949 hartree
zpe.sumelectzpe: -648.138405 hartree
zpe.sumelectthermal: -648.124846 hartree
zpe.sumelectthermalent: -648.123901 hartree
zpe.sumelectthermalfe: -648.179240 hartree
dipole: 2.3331 4.0915 -0.2902
dipole: 4.7188
quadrupole: -59.6176 -80.2451 -87.4747
quadrupole: 0.3927 -1.3316 1.1117
quadrupole: 16.1615 -4.4660 -11.6955 0.3927 -1.3316 1.1117
hfenergy: -648.3521895 hartree
pointgroup: C01 [X(C12H12N2O1)]
dipole: -0.8916111 -1.6254849 -0.0976471 debye
polarizability: 222.5900684|14.423205|137.6632864|10.2835434|-5.1075951|95.4945103 unknown
InChI: InChI=1S/C12H12N2O/c13-9-4-6-11(7-5-9)15-12-3-1-2-10(14)8-12/h1-8H,13-14H2
charge 0 multiplicity 1
27 atoms
O  0.135199 1.476155 -0.002571
N  2.955353 -2.536076 -0.482555
N  -4.884072 -1.134791 0.214231
C  1.380279 0.79961 0.044822
C  -1.082352 0.738199 0.039964
C  1.514678 -0.577485 -0.229989
C  2.808455 -1.172639 -0.209939
C  -1.407158 -0.098383 1.132214
C  -2.023658 0.959745 -0.986214
C  2.500222 1.612221 0.337707
C  -3.63158 -0.514692 0.15712
C  -2.667667 -0.723985 1.187526
C  -3.289764 0.342214 -0.928981
C  3.944994 -0.365844 0.087664
C  3.775799 1.009217 0.352108
H  0.633168 -1.181768 -0.46974
H  -0.678278 -0.252444 1.934917
H  -1.758249 1.621834 -1.816269
H  2.354931 2.675921 0.542124
H  -2.914214 -1.369796 2.039263
H  -4.018048 0.524233 -1.72868
H  4.944711 -0.815557 0.108261
H  4.655576 1.622783 0.578011
H  3.875489 -2.964796 -0.496885
H  2.150689 -3.112259 -0.709318
H  -5.137202 -1.725094 1.000436
H  -5.579701 -0.970123 -0.506629
