program: Gaussian 09
title: 000075869
version: EM64L-G09RevD.01
frameworkgroup: C1[X(C10H7N2O4S)]
method: RPBEPBE
basis: SDD
operation: Freq
keyword: #p
keyword: freq=noraman
keyword: PBEPBE/SDD
title: #p freq=noraman PBEPBE/SDD
converged: YES YES NO NO
title: Mulliken charges:
elementType: S O O O O N N C C C C C C C C C C H H H H H H H
charge: 0.994710 -0.364106 -0.559141 -0.455104 -0.463319 0.028124 0.161279 0.508883 0.406742 -0.238867 -0.036882 -0.353893 -0.346560 -0.235352 -0.238507 0.300062 -0.383590 0.319346 0.223843 0.321897 0.285363 0.295306 0.420638 0.409129
chargesum: 1.00000
title: Mulliken charges with hydrogens summed into heavy atoms:
elementType: S O O O O N N C C C C C C C C C C
charge: 0.994710 0.056532 -0.150013 -0.455104 -0.463319 0.028124 0.161279 0.508883 0.406742 -0.238867 -0.036882 -0.034547 -0.122718 0.086545 0.046856 0.300062 -0.088284
polarizability: 2.70307072e+02 -3.51993654e+01 1.84989298e+02 1.95884488e+00 1.06984711e+00 7.67796842e+01
1716.lowfreq: 0.0012 0.0016 0.0022 4.0813 6.6713 11.6002 40.4884 53.3641 81.8250
frequency: 40.4510 53.3570 81.8208 108.4362 128.3054 153.3763 195.5061 199.4840 219.6056 229.8183 254.5794 274.2290 305.1828 321.5030 339.8724 394.3263 412.4256 415.8168 440.5720 440.6917 484.2985 489.6451 533.3835 548.7566 564.7634 585.2058 631.6502 668.7218 678.1040 750.4418 760.7475 814.7104 832.5032 848.3479 851.6760 915.5075 946.2163 966.7927 975.8882 1010.8728 1050.5942 1076.3928 1083.2184 1130.4930 1181.1074 1211.1195 1225.1639 1259.8029 1273.9486 1371.4021 1388.7039 1422.4180 1436.9653 1446.3882 1493.1582 1553.7948 1590.6414 1616.1153 2098.6599 3125.3941 3147.5502 3168.5560 3185.5175 3188.9642 3473.9722 3582.8357
redmass: 10.3830 6.2510 7.5090 10.4388 5.8394 9.9665 4.8835 4.5909 7.2663 6.5653 2.7844 3.4171 2.3054 5.8744 8.0546 8.7128 3.0149 1.8393 9.6258 4.3206 4.8724 6.1305 5.8985 5.7833 6.8752 4.8803 7.1744 6.9051 3.4791 6.8978 1.7068 1.6117 7.5590 3.4885 5.9181 3.7181 1.3635 2.2962 2.7277 1.3999 1.1856 2.1816 4.0810 1.6302 1.4133 1.5035 2.8429 1.7205 2.1052 3.2225 2.6149 6.0863 2.8425 2.8135 4.3246 6.9780 6.2361 6.5162 13.8969 1.0905 1.0926 1.0907 1.0974 1.0991 1.0664 1.0670
irintensity: 0.2597 0.2314 0.2104 2.3053 0.4199 1.8111 3.5474 4.0808 10.7447 3.5427 25.8281 12.1690 76.1762 20.6992 5.9078 1.0065 106.9059 115.9612 2.3491 0.0312 42.1149 17.6490 28.4490 44.8120 53.5774 2.5269 38.9171 2.7698 0.4533 5.5603 27.4264 68.5816 84.9216 10.3651 3.2433 26.2143 2.8187 43.2877 34.5279 1.1281 73.4106 1.9151 74.2879 121.4642 2.1873 2.3821 39.3222 9.7678 47.9101 107.4169 6.1767 148.9441 30.9794 12.1985 44.1652 39.8702 38.6824 252.8282 475.4363 5.0372 16.1857 26.0163 1.8971 7.9790 96.3596 125.6364
temp: 298.150 k
press: 1.00000 atm
elementType: 16 8 8 8 8 7 7 6 6 6 6 6 6 6 6 6 6 1 1 1 1 1 1 1
symmnumber: 1
zpe: 410621.0 jmol-1
zpe.correction: 0.156397 hartree
zpe.thermalcorrener: 0.171964 hartree
zpe.thermalcorrenthalpy: 0.172908 hartree
zpe.thermalcorrgfe: 0.113517 hartree
zpe.sumelectzpe: -1192.043091 hartree
zpe.sumelectthermal: -1192.027525 hartree
zpe.sumelectthermalent: -1192.026581 hartree
zpe.sumelectthermalfe: -1192.085972 hartree
dipole: 9.2821 2.8657 1.6215
dipole: 9.8488
quadrupole: -67.6743 -67.3463 -105.1898
quadrupole: -1.5617 -8.1663 -4.9964
quadrupole: 12.3958 12.7239 -25.1197 -1.5617 -8.1663 -4.9964
hfenergy: -1192.1994885 hartree
pointgroup: C01 [X(C10H7N2O4S1)]
dipole: -3.5629034 -1.3912456 0.6199155 debye
dipolederiv: 1.8713721 0.2534502 -0.0102355 0.5213309 1.2983433 0.0816514 0.128046 0.1172648 1.5624636 -0.7298056 -0.6532362 0.0090723 -0.5058119 -0.8108402 0.0099491 0.0146437 0.0153144 -0.344612 -0.5103899 0.0262609 -0.0731434 -0.0500243 -0.5443854 -0.1967704 -0.2239639 -0.2191054 -0.9367609 -0.6930533 -0.0167856 0.0467372 -0.04338 -0.4731678 -0.0424544 -0.0314382 -0.0020195 -0.4277978 -0.6608547 -0.0411707 -0.0747465 -0.1131854 -0.5305946 0.0926805 0.0052305 0.0376982 -0.4990228 2.1683163 -0.9457281 -0.0253062 -0.5645957 0.2618795 0.0088721 -0.0404159 0.0193693 0.1981343 -1.0458831 0.5302964 0.0142123 0.2893723 -0.0361149 -0.0037582 0.0234612 -0.0100765 0.0858797 0.4910242 -0.3217085 -0.0063751 -0.472215 0.1500775 -0.0063928 0.0151533 0.0071185 0.0901249 -0.8291976 -0.2661492 0.0117947 0.1771662 0.0051661 0.0017531 0.0002207 -0.0012596 0.0347206 -0.3900201 0.3449708 -0.0053348 0.4680007 -0.2766917 0.0209618 0.08292 0.0826113 -0.1338138 1.3247145 0.4627018 -0.0230745 -0.2494767 0.9317184 -0.0029623 -0.0208893 -0.0125415 0.1512593 -0.2943987 0.3401448 0.0079212 0.1936271 -0.2118575 0.0075358 0.010404 -0.023296 -0.0573348 0.1421912 0.2086777 -0.0061756 -0.1966507 -0.016664 0.0021501 0.0020836 0.0005608 -0.0971575 -0.0413254 -0.13465 0.0006117 -0.0771228 0.1785896 -0.0032219 0.0076346 -0.0117202 -0.0143222 -0.1967547 -0.2152184 0.0026119 -0.1872538 0.1338739 -0.0003812 -0.0172929 -0.0126256 -0.0896654 -1.1137593 0.6719704 0.012908 0.4040504 -0.1954069 -0.00638 0.0198939 -0.0132983 0.0578786 0.4462241 -0.2739859 -0.0100033 0.353961 0.0262407 -0.0091062 -0.0100144 0.0063452 -0.1016673 0.1848658 -0.0226848 0.0061361 0.045419 0.117797 -0.0022909 -0.0311669 0.0124708 0.1349625 -0.0195724 -0.1265908 0.0030983 -0.057725 0.0438492 0.0006825 0.0053724 0.0030243 0.1514079 0.1481939 0.0106565 0.0063879 -0.0096671 0.1832397 0.0064288 0.0117487 0.0051702 0.155051 0.0736472 0.000439 0.000905 -0.0022601 0.0170865 -0.0001416 0.0023579 0.0028768 0.1710291 0.059535 0.0355944 0.0027795 -0.0121841 0.0923288 0.0011758 0.0027656 0.0019586 0.1811072 0.3833734 0.1891704 -0.0006932 0.1813162 0.3613091 -0.0017035 -0.001998 -0.0025015 0.4036357 0.2315571 -0.056425 0.109912 -0.092691 0.2942236 0.0417224 0.0452434 -0.0033389 0.3245 unknown
polarizability: 274.8448811|-28.8025517|180.464534|-2.2924337|0.1862012|76.766639 unknown
InChI: InChI=1S/C10H7N2O4S/c11-12-8-5-4-6-7(10(8)13)2-1-3-9(6)17(14,15)16/h1-5,13-14H
charge 1 multiplicity 1
24 atoms
S  3.106137 0.867788 -0.065128
O  -3.086857 -1.623984 0.074256
O  2.803095 1.378474 1.685083
O  4.497195 0.067443 -0.210342
O  2.743684 2.106658 -1.036999
N  -3.746521 0.923698 0.066511
N  -4.881797 1.164055 0.089736
C  0.330582 -0.009712 -0.011722
C  -0.647072 -1.089425 0.01352
C  1.696042 -0.412622 -0.027152
C  -2.039156 -0.744737 0.042426
C  -0.098442 1.370068 -0.020311
C  -0.213923 -2.45717 0.015753
C  2.119933 -1.738539 -0.020578
C  1.1432 -2.778257 -0.00513
C  -2.412172 0.635414 0.038185
C  -1.439008 1.699078 0.005086
H  0.648659 2.166386 -0.064943
H  -0.93556 -3.283155 0.030647
H  3.191466 -1.969847 -0.032762
H  1.46589 -3.822623 -0.004646
H  -1.773147 2.739796 -0.002697
H  -2.842721 -2.583453 0.082793
H  3.531994 2.000268 1.979911
