program: Gaussian 16
title: cl_biphenylene
version: AS64L-G16RevC.02
method: RwB97XD
basis: GenECP
operation: Freq
keyword: #N
keyword: Geom=AllCheck
keyword: Guess=TCheck
keyword: SCRF=Check
keyword: GenChk
keyword: RwB97XD/GenECPFreq
converged: YES YES NO YES
title: Mulliken charges:
elementType: C C C C C C C H C H H C H C H C C H B N C H H H C H H H Cl Cl
charge: 0.267452 0.491514 -0.085845 -0.532507 -0.320427 -0.009028 -0.331145 0.196751 -0.247619 0.238619 0.196885 -0.270625 0.221008 -0.449152 0.243370 -0.333943 0.546552 0.211351 -0.578757 0.240041 -0.403732 0.165640 0.179151 0.168022 -0.519487 0.199053 0.184816 0.133447 0.085917 0.112676
chargesum: -0.00000
title: Mulliken charges with hydrogens summed into heavy atoms:
elementType: C C C C C C C C C C C C B N C C Cl Cl
charge: 0.267452 0.491514 -0.085845 -0.532507 -0.123676 -0.009028 -0.092527 -0.050734 -0.049616 -0.205782 -0.122591 0.546552 -0.578757 0.240041 0.109082 -0.002172 0.085917 0.112676
chargesum: 0.00000
1716.lowfreq: -1.0603 0.0018 0.0021 0.0024 7.8412 11.4724 32.7934 52.0133 71.6024
frequency: 32.6947 51.9724 71.6000 100.6583 120.3009 138.4286 162.2320 175.8654 208.1648 240.9376 261.6479 280.2177 305.7122 321.3161 342.7467 357.7509 375.5537 400.5594 440.1312 468.5062 484.8680 550.0308 562.5508 575.5760 609.3775 644.5934 648.6485 708.7459 734.0023 744.1765 777.2988 793.4983 829.8327 855.8637 903.1723 920.8830 943.4343 956.9994 996.2098 998.8084 1001.7960 1010.2513 1051.5957 1079.8216 1087.5630 1124.6072 1135.9096 1168.2329 1174.2463 1194.9039 1200.1403 1222.4822 1238.9759 1251.3518 1299.8162 1321.7089 1396.7336 1402.4939 1442.1276 1451.5744 1476.7798 1491.8689 1497.7858 1505.7381 1508.5711 1518.6429 1529.0255 1541.3509 1634.9644 1658.5591 1675.0339 1740.9061 2976.8261 2989.1323 3095.9947 3099.4234 3141.2100 3158.7143 3191.0006 3191.6173 3205.2526 3216.5159 3219.9210 3224.8128
redmass: 11.6340 6.6499 5.0644 5.2515 5.3140 5.1788 3.0968 4.1694 10.7091 3.3710 1.8024 1.7574 1.7097 2.5217 3.7923 5.2230 3.1057 6.3800 5.3804 4.2799 4.7058 4.1585 4.0484 5.0504 6.3239 5.8183 4.7837 7.6072 3.0875 4.8651 1.5023 1.6105 4.7757 6.3203 1.3990 9.9701 1.4076 5.2437 1.3805 3.7863 1.4356 3.6382 3.2293 1.6487 1.4319 1.2929 2.0473 1.7506 1.6607 2.0003 1.3575 2.4514 1.9444 2.7621 3.1021 3.6582 2.6956 2.4430 2.4471 1.2098 1.2645 2.1447 1.0454 1.2353 1.0746 1.2261 6.2676 1.6356 8.7524 9.0487 6.7209 8.3566 1.0551 1.0554 1.0786 1.0820 1.1043 1.1005 1.0867 1.0882 1.0928 1.0970 1.0922 1.0956
irintensity: 0.5934 0.6533 0.7915 4.3951 1.1078 0.6268 2.3283 0.6752 0.5614 2.2807 5.6162 0.4987 2.1029 2.2431 2.1424 0.4500 2.4180 0.2046 6.9333 3.5356 5.6899 2.0151 11.5199 16.1106 0.7746 4.3495 2.7553 65.9117 30.2660 8.2432 5.4061 110.6979 2.3828 63.1439 1.3556 396.3749 7.4618 116.5372 1.6907 29.5979 3.3568 24.7757 21.3401 16.2381 15.4589 5.4896 76.1235 118.6907 21.9490 48.0430 10.0192 12.3442 14.7028 143.2739 23.4149 88.9933 146.2756 54.4956 17.8257 5.9278 34.2345 14.5388 15.7994 49.3910 3.3008 7.2446 9.1749 153.4118 162.9860 131.8334 143.3138 34.2908 125.0738 115.8154 36.9980 29.0209 18.2645 19.5543 0.5004 8.8740 10.7453 20.8616 10.8975 16.0268
temp: 298.150 k
press: 1.00000 atm
elementType: 6 6 6 6 6 6 6 1 6 1 1 6 1 6 1 6 6 1 5 7 6 1 1 1 6 1 1 1 17 17
symmnumber: 1
zpe: 603166.4 jmol-1
zpe.correction: 0.229734 hartree
zpe.thermalcorrener: 0.245521 hartree
zpe.thermalcorrenthalpy: 0.246465 hartree
zpe.thermalcorrgfe: 0.185870 hartree
zpe.sumelectzpe: -1540.471924 hartree
zpe.sumelectthermal: -1540.456137 hartree
zpe.sumelectthermalent: -1540.455193 hartree
zpe.sumelectthermalfe: -1540.515788 hartree
dipole: -1.5672 1.9977 -0.9965
dipole: 2.7276
quadrupole: -128.4222 -96.0586 -110.9808
quadrupole: -5.1132 -7.4553 5.9459
quadrupole: -16.6017 15.7619 0.8397 -5.1132 -7.4553 5.9459
hfenergy: -1540.7016578 hartree
pointgroup: C01 [X(C14H12B1Cl2N1)]
dipole: -0.6165768 0.7859377 -0.3920506 debye
polarizability: 149.4728375|-36.6127413|334.0810353|-1.9325427|0.2866869|284.480884 unknown
InChI: InChI=1/C14H12BCl2N/c1-18(2)12-8-4-6-10-9-5-3-7-11(15(16)17)13(9)14(10)12/h3-8H,1-2H3
charge 0 multiplicity 1
30 atoms
C  1.91646034 2.4860675 -0.15648328
C  1.85187186 2.54773961 -1.57259666
C  1.5755306 4.02403481 -1.48984444
C  1.56630985 3.94809655 -0.07898432
C  1.40295021 5.1870222 -2.18581776
C  1.26670344 5.03916989 0.72108652
C  1.18373838 6.32514396 -1.38022917
H  1.42865272 5.25284534 -3.26590879
C  1.10772648 6.25810743 -0.00077143
H  1.04085885 7.28965722 -1.85550744
H  0.89334845 7.16988785 0.54171905
C  2.03785504 1.45759229 -2.36666031
H  1.99406289 1.49561481 -3.44856192
C  2.29774594 0.23708026 -1.68834319
H  2.4413212 -0.66852724 -2.2665402
C  2.39192016 0.17772853 -0.31687653
C  2.23942029 1.32992066 0.52367685
H  2.61754678 -0.7758712 0.14769873
B  2.57347033 1.24888533 2.02595951
N  1.11988085 4.95448258 2.09974757
C  0.98728992 6.1823861 2.85662091
H  0.01770257 6.68141646 2.69999718
H  1.07793762 5.94543557 3.91823603
H  1.78839078 6.87708419 2.59962731
C  0.26756832 3.88516684 2.59575268
H  0.52130769 3.66018602 3.63375182
H  -0.79545323 4.1653409 2.5443306
H  0.39893011 2.97753863 2.00790277
Cl 3.36578321 2.58339934 2.85832283
Cl 2.2725215 -0.221546 2.96060266
