program: Gaussian 16
title: cl_dibenzofuran
version: AS64L-G16RevC.02
method: RwB97XD
basis: GenECP
operation: Freq
keyword: #N
keyword: Geom=AllCheck
keyword: Guess=TCheck
keyword: SCRF=Check
keyword: GenChk
keyword: RwB97XD/GenECP
keyword: Freq
converged: YES YES NO YES
title: Mulliken charges:
elementType: C C O C C C C C H C H H C H C H C C H B N C H H H C H H H Cl Cl
charge: -0.761245 1.513245 0.028786 1.470255 -1.800785 -0.152563 -0.418044 -0.302871 0.174838 0.338289 0.241497 0.193979 -0.163801 0.193795 -0.412616 0.253057 -0.579587 -0.211051 0.168620 0.008374 0.074965 -0.451829 0.174990 0.170453 0.114349 -0.393984 0.182428 0.163307 0.165316 0.038566 -0.020735
chargesum: -0.00000
title: Mulliken charges with hydrogens summed into heavy atoms:
elementType: C C O C C C C C C C C C C B N C C Cl Cl
charge: -0.761245 1.513245 0.028786 1.470255 -1.800785 0.022275 -0.418044 -0.061373 0.532268 0.029994 -0.159559 -0.410966 -0.211051 0.008374 0.074965 0.007963 0.117067 0.038566 -0.020735
1716.lowfreq: -7.3167 -0.0012 -0.0007 0.0007 1.2831 4.9887 17.4365 47.2799 67.4135
frequency: 17.3665 47.2705 67.4119 82.2701 95.2841 136.0722 156.4949 176.6140 205.7704 218.9158 249.0707 276.1755 289.1153 301.3870 310.7081 338.5122 369.1708 385.0063 389.6825 430.1915 500.1294 558.2064 562.7300 579.7295 587.6878 599.0166 614.5854 641.5217 680.2693 716.5635 756.1240 777.8229 802.7881 825.7605 834.1958 870.4118 893.0698 899.4950 923.8852 962.5281 970.1097 992.0915 1009.1674 1053.9618 1084.9263 1100.0339 1103.6711 1125.8389 1167.5383 1175.5980 1193.6853 1208.2963 1217.2822 1244.2442 1263.2363 1284.8886 1298.5928 1338.4233 1365.5835 1387.4657 1394.5178 1445.6003 1451.8563 1471.8977 1480.4796 1490.5424 1502.4330 1504.8034 1521.2244 1531.1871 1554.9731 1643.7897 1665.5167 1674.2252 1690.8220 2971.2665 2983.4075 3093.4155 3102.8421 3139.4097 3180.7531 3195.5383 3198.6853 3209.7634 3215.5290 3221.7828 3228.2484
redmass: 20.9827 5.1256 3.2739 6.4160 4.6969 3.7415 5.2100 2.0354 1.6305 14.3518 4.9725 2.5046 2.1037 2.9821 4.4896 3.8354 4.6370 7.7301 3.1883 5.8377 4.4864 3.7739 4.8525 4.0496 5.8374 6.2041 5.4463 5.0548 7.7900 7.0430 1.7001 2.2691 2.2847 2.5782 6.7920 6.4521 6.3978 1.4343 10.5931 1.3840 4.5520 1.3039 1.3313 3.2973 1.4369 1.9976 2.0297 1.2659 2.0144 1.4568 1.2691 1.9740 2.4770 2.3466 2.3259 4.6644 2.8054 2.0728 7.4274 4.2461 3.2707 2.2059 1.4427 1.9414 1.4036 1.0424 1.1221 1.0495 1.1752 2.8887 2.9561 7.1013 7.5357 6.9672 8.5143 1.0558 1.0565 1.0776 1.0837 1.1043 1.0983 1.0876 1.0877 1.0920 1.0948 1.0971 1.0932
irintensity: 0.0068 0.4092 1.0571 1.0579 4.1631 0.0246 1.4251 1.0286 0.9176 0.5138 1.9853 5.2772 0.1740 0.9608 1.1949 1.0910 2.1715 0.4085 1.8412 4.1493 2.7556 0.2532 18.4513 2.4542 9.6654 16.0007 2.5163 2.2197 43.0284 17.0141 33.0419 55.6126 58.4258 1.4445 114.2040 49.2267 19.8728 0.5698 374.6789 0.4961 98.8131 0.5215 0.1448 91.1021 25.7389 29.2019 3.4663 3.5198 114.8713 20.2092 7.1254 92.4695 346.7597 26.7867 56.2603 115.5154 183.6544 14.1095 8.3989 26.3635 86.0675 127.4174 45.6934 21.7923 26.9191 19.2353 7.0829 31.2557 17.6351 56.2397 163.0523 35.3657 143.0310 61.1317 53.7642 98.4303 138.3773 34.4315 36.7168 22.8832 2.0940 8.0266 1.7862 3.1751 13.4728 16.1810 7.8962
temp: 298.150 k
press: 1.00000 atm
elementType: 6 6 8 6 6 6 6 6 1 6 1 1 6 1 6 1 6 6 1 5 7 6 1 1 1 6 1 1 1 17 17
symmnumber: 1
zpe: 618936.8 jmol-1
zpe.correction: 0.235741 hartree
zpe.thermalcorrener: 0.252187 hartree
zpe.thermalcorrenthalpy: 0.253131 hartree
zpe.thermalcorrgfe: 0.190163 hartree
zpe.sumelectzpe: -1615.761783 hartree
zpe.sumelectthermal: -1615.745337 hartree
zpe.sumelectthermalent: -1615.744393 hartree
zpe.sumelectthermalfe: -1615.807361 hartree
dipole: -0.5837 2.2678 -2.2650
dipole: 3.2579
quadrupole: -127.5062 -102.6278 -118.2073
quadrupole: -3.8455 -7.9800 5.7408
quadrupole: -11.3924 13.4860 -2.0936 -3.8455 -7.9800 5.7408
hfenergy: -1615.9975241 hartree
pointgroup: C01 [X(C14H12B1Cl2N1O1)]
dipole: -0.2296293 0.8922055 -0.8911312 debye
polarizability: 173.6530345|-80.8588442|294.4009426|5.4968739|4.3516904|290.6665874 unknown
InChI: InChI=1/C14H12BCl2NO/c1-18(2)12-8-4-6-10-9-5-3-7-11(15(16)17)13(9)19-14(10)12/h3-8H,1-2H3
charge 0 multiplicity 1
31 atoms
C  2.10373407 2.16717815 0.21220062
C  1.91391047 2.53335729 -1.12628859
O  1.62328133 3.12344827 1.04612291
C  1.26080318 3.82760109 -1.09421133
C  1.1211019 4.12844411 0.25635649
C  0.77134147 4.70082805 -2.06664707
C  0.51055925 5.29450445 0.74066052
C  0.15347909 5.8553607 -1.62301497
H  0.86380469 4.47832888 -3.12258269
C  0.03132403 6.1490109 -0.25873956
H  -0.2436856 6.56338045 -2.34149719
H  -0.45044022 7.07564024 0.02389546
C  2.33482664 1.68072417 -2.13891382
H  2.19502857 1.94748397 -3.18040719
C  2.93774221 0.47908593 -1.78741485
H  3.27423648 -0.20236641 -2.55928384
C  3.11455777 0.1379108 -0.44988219
C  2.70687681 0.96696694 0.61237222
H  3.58855487 -0.80757387 -0.21553312
B  2.93458858 0.53780253 2.07749049
N  0.35604293 5.53014437 2.10875584
C  1.55687787 5.43454654 2.93287473
H  2.21811351 6.30229135 2.78505682
H  1.26216666 5.39931716 3.98357195
H  2.10982996 4.52593848 2.70858364
C  -0.4890797 6.64483805 2.4883413
H  -0.65926393 6.59778586 3.56530343
H  -0.04080751 7.62478567 2.25691741
H  -1.45759045 6.57463179 1.98999398
Cl 2.5124839 1.53529272 3.46565957
Cl 3.66502419 -1.03179527 2.45354416
