program: Gaussian 16
title: cl_indole
version: AS64L-G16RevC.02
method: RwB97XD
basis: GenECP
operation: Freq
keyword: #N
keyword: Geom=AllCheck
keyword: Guess=TCheck
keyword: SCRF=Check
keyword: GenChk
keyword: RwB97XD/GenECPFreq
converged: YES YES YES YES
title: Mulliken charges:
elementType: C C C C C C C C H H H N H B C H H H C H H H Cl Cl
charge: -0.103504 0.728750 -1.781210 -1.263548 0.399718 -0.379628 -0.303986 1.434580 0.149251 0.208027 0.210395 0.263904 0.204660 0.003744 -0.389269 0.185502 0.176190 0.159347 -0.445180 0.186116 0.181408 0.186335 0.009881 -0.021483
chargesum: -0.00000
title: Mulliken charges with hydrogens summed into heavy atoms:
elementType: C C C C C C C C N B C C Cl Cl
charge: -0.103504 0.933410 -1.781210 -1.114297 0.399718 -0.171601 -0.093590 1.434580 0.263904 0.003744 0.131771 0.108679 0.009881 -0.021483
1716.lowfreq: -0.0018 -0.0015 -0.0011 4.7511 6.1036 8.0163 26.4189 56.8882 87.1020
frequency: 26.1962 56.8843 87.0982 118.6430 128.4848 174.4729 203.4466 214.3570 240.6904 270.9886 293.0756 340.4616 360.7688 387.2576 440.7964 496.5189 504.6870 566.1077 580.6020 619.7493 663.6220 702.0604 764.9784 772.1781 817.1843 846.3252 867.5837 877.9474 905.4572 929.7015 976.9922 992.5459 1032.8326 1066.9328 1132.3753 1147.0869 1157.3901 1183.8280 1204.4780 1239.6805 1280.7338 1359.0688 1381.9439 1401.9206 1418.5937 1427.1799 1465.9259 1483.3416 1490.3427 1497.9242 1503.5760 1524.1112 1543.3434 1565.0262 1632.2779 1700.0013 3044.3974 3074.2598 3108.9197 3134.1187 3147.9375 3179.1970 3183.3082 3203.0282 3205.5057 3265.3556
redmass: 6.7865 5.3029 1.0509 8.3399 3.3364 3.7358 1.1580 11.1559 6.3928 3.8605 3.2602 4.1400 8.6709 3.7216 3.0342 5.4693 6.7399 3.7238 5.7487 3.2355 4.4738 5.4311 6.8235 3.3526 1.3248 4.7064 1.3812 1.6722 7.2856 5.4115 2.2277 1.3156 1.5862 1.5532 1.9306 1.3073 1.5176 1.4747 2.1766 2.4355 2.1569 2.4074 3.6895 4.7227 1.3132 5.2283 1.5967 1.0420 1.1309 1.0914 1.9565 1.2224 3.8535 4.1883 6.6297 6.8237 1.0369 1.0350 1.1009 1.1023 1.1059 1.1019 1.0879 1.0921 1.0953 1.0970
irintensity: 0.4551 0.0149 0.5914 0.3256 2.0623 3.1526 0.1415 1.4162 0.7567 0.0621 1.8556 0.0045 0.7832 1.2247 14.4985 20.2968 0.8315 17.2440 2.8623 11.6395 9.0930 22.4051 20.4353 2.0960 23.0839 39.0440 29.9619 17.5380 311.1004 286.3762 40.9214 0.5176 60.0508 5.1791 31.9577 0.3306 263.4176 190.6740 72.4832 19.7073 19.0990 22.1059 9.7783 50.3193 9.7601 369.4505 56.8545 9.3454 3.3194 24.7188 89.8498 23.3064 279.2867 89.9833 21.1260 129.2879 42.2181 48.6635 16.1445 20.6353 14.5534 8.3292 8.1391 23.6247 14.4325 0.3639
temp: 298.150 k
press: 1.00000 atm
elementType: 6 6 6 6 6 6 6 6 1 1 1 7 1 5 6 1 1 1 6 1 1 1 17 17
symmnumber: 1
zpe: 482177.6 jmol-1
zpe.correction: 0.183652 hartree
zpe.thermalcorrener: 0.196795 hartree
zpe.thermalcorrenthalpy: 0.197739 hartree
zpe.thermalcorrgfe: 0.142439 hartree
zpe.sumelectzpe: -1386.991055 hartree
zpe.sumelectthermal: -1386.977911 hartree
zpe.sumelectthermalent: -1386.976967 hartree
zpe.sumelectthermalfe: -1387.032267 hartree
dipole: -0.1932 3.8104 -0.0901
dipole: 3.8163
quadrupole: -88.8881 -96.8572 -99.2657
quadrupole: -0.8428 -0.7111 -0.9119
quadrupole: 6.1156 -1.8535 -4.2621 -0.8428 -0.7111 -0.9119
hfenergy: -1387.1747065 hartree
pointgroup: C01 [X(C10H10B1Cl2N1)]
dipole: -0.0759985 1.4991102 -0.0354496 debye
dipolederiv: -1.200327 1.6931234 0.0281192 1.3038199 -1.1512191 -0.0636184 0.0388138 -0.086073 -0.1158816 0.3344196 -0.9114742 -0.0109851 -0.2029193 0.6183938 -0.0028358 -0.0241527 0.0379173 -0.1593084 0.3727427 -0.1006321 -0.0166312 -0.3082964 -0.0040844 0.0241138 -0.0149315 0.0100301 0.0912313 -0.1849431 0.0710883 -0.0016743 0.1797516 0.0122051 -0.0160104 -0.0022339 -0.0074889 -0.1953336 0.0801864 0.3527159 -0.0200293 -0.0955922 0.5352143 -0.0071455 -0.0085298 -0.0372508 -0.0909865 0.1298715 -0.2978756 -0.0144435 0.1870651 -0.79255 0.001362 -0.0253805 0.0318765 -0.1921337 0.3557274 -0.4252297 -0.0223269 -0.1697567 0.5287425 -0.0026214 -0.0277993 0.0157335 -0.1197217 -0.3642032 0.2739953 0.0141265 0.0514866 -0.6857798 0.0104046 0.0175999 -0.0038637 -0.0555428 -0.0209347 -0.105799 0.014297 -0.0732174 -0.0000578 0.008365 0.0132932 0.0121223 0.1567716 -0.0931873 0.095273 0.0145533 0.1025255 0.0243267 -0.0040258 0.0141075 -0.0033387 0.156814 -0.0470847 -0.0581286 0.0143884 -0.10227 0.0250982 0.0095105 0.0153553 0.0069909 0.147856 -0.822591 0.032018 0.0430006 -0.5008869 -0.1458785 0.0316561 0.0566019 0.0018653 -0.1474201 0.0794329 -0.0579466 0.0061231 -0.0430755 0.0075423 0.0063096 0.0062881 0.006558 0.1574551 2.5507817 -0.5687798 -0.1031754 -0.6702618 2.80062 0.0007073 -0.101773 -0.0122165 0.2886929 0.7022153 0.0676328 -0.0282455 0.1727673 0.1097466 -0.0086014 -0.0329598 -0.0011364 0.2435181 -0.0900663 -0.0205358 -0.0227975 0.0318748 0.0867989 0.0648959 -0.0993254 0.0486662 -0.0426893 -0.0680901 -0.02242 0.0280472 0.0396266 0.0716377 -0.084516 0.099572 -0.061768 -0.0464158 0.0714308 0.0603435 -0.002767 -0.0549724 -0.094268 0.0142744 0.0015735 0.0041072 0.1038686 0.0449132 0.1623845 0.0018257 0.0505161 -0.0640494 0.0007665 0.0035856 -0.0056425 0.1239165 0.0511372 0.0338445 0.083913 0.0617577 -0.0690696 -0.0170412 0.0989405 -0.0922797 -0.0536638 -0.0916494 -0.1558142 0.0152133 -0.0071895 -0.0287311 0.0029003 0.0122475 0.0128222 0.0863101 0.0256546 0.0414998 -0.0962368 0.0593096 -0.0648996 0.0102127 -0.1115595 0.0875898 -0.0320353 -1.4536446 0.3049886 0.0588348 0.0490035 -0.3405419 0.0007587 0.0608497 -0.0129753 -0.1508438 -0.361792 -0.4642721 0.0168706 -0.0610661 -1.3791969 0.0201785 0.0098168 0.0477541 -0.1544578 unknown
polarizability: 233.6095303|-56.0573158|266.0086809|-6.8703407|0.2104491|104.2885036 unknown
InChI: InChI=1/C10H10BCl2N/c1-7-3-4-8-6-10(11(12)13)14(2)9(8)5-7/h3-6H,1-2H3
charge 0 multiplicity 1
24 atoms
C  -1.09861002 -1.23307275 -0.14778875
C  -2.48210005 -1.26631643 -0.05439376
C  -1.81872276 0.89737556 -0.14500526
C  -1.94121437 2.2987736 -0.16566482
C  -3.20229544 2.85160169 -0.09249981
C  -4.3458663 2.01305101 0.00187829
C  -4.23710304 0.6459113 0.02367502
C  -2.95624823 0.06429091 -0.05046183
H  -1.07337522 2.94421849 -0.23534292
H  -5.32522768 2.4771376 0.05808032
H  -5.11889441 0.01894812 0.09639831
N  -0.70540364 0.10817651 -0.20402751
H  -3.07687873 -2.16472538 0.00579445
B  -0.2203924 -2.47741352 -0.16805218
C  0.6504149 0.61339617 -0.31308103
H  1.24342665 0.33175405 0.55790358
H  1.13429508 0.23449393 -1.21362155
H  0.61797115 1.69899074 -0.37247837
C  -3.39339667 4.34507134 -0.11049395
H  -3.89928663 4.6827119 0.79866349
H  -2.43979172 4.87088419 -0.18373479
H  -4.01425208 4.64655746 -0.95913268
Cl 1.5483951 -2.47612715 -0.24964368
Cl -0.9759399 -4.08071596 -0.10188309
