program: Gaussian 16
title: cl_nmeimidazole
version: AS64L-G16RevC.02
method: RwB97XD
basis: GenECP
operation: Freq
keyword: #N
keyword: Geom=AllCheck
keyword: Guess=TCheck
keyword: SCRF=Check
keyword: GenChk
keyword: RwB97XD/GenECP
keyword: Freq
converged: YES YES NO NO
title: Mulliken charges:
elementType: C H C N N B C H H H C H Cl Cl
charge: -0.293535 0.209544 -0.362075 0.042815 -0.111381 -0.002300 -0.362513 0.169251 0.208324 0.202238 0.048442 0.246399 0.041363 -0.036570
chargesum: -0.00000
title: Mulliken charges with hydrogens summed into heavy atoms:
elementType: C C N N B C C Cl Cl
charge: -0.083992 -0.362075 0.042815 -0.111381 -0.002300 0.217300 0.294840 0.041363 -0.036570
1716.lowfreq: -8.8689 -3.6921 0.0014 0.0017 0.0021 13.8074 47.8528 69.8585 110.0509
frequency: 47.5903 69.7271 110.0445 120.6494 219.5320 247.5266 290.4400 401.2576 419.7039 509.0112 637.6928 692.1144 711.3683 839.4660 854.9122 876.5557 926.0774 1037.2350 1074.5665 1094.2119 1153.1821 1201.8063 1261.0600 1341.0086 1389.4308 1458.1203 1471.8823 1491.5264 1508.6835 1547.3469 1596.2048 3071.0043 3152.4875 3171.2388 3254.3825 3277.7436
redmass: 1.6703 2.0301 7.9463 4.1970 14.3801 4.0814 5.2638 18.9375 3.8739 9.1971 2.8063 4.6730 4.4464 1.4952 9.8835 1.4315 11.3679 3.6920 3.3449 1.6410 1.3199 1.7154 1.5037 5.9309 4.2340 2.3600 1.9491 1.0368 1.3183 3.0726 4.2364 1.0331 1.1066 1.1049 1.0983 1.1002
irintensity: 1.7250 2.9690 1.6162 0.5286 1.5106 0.0814 0.6313 0.9781 1.5201 9.6013 33.1821 3.7864 0.2802 2.0232 235.9748 30.2542 483.1988 22.1083 10.7656 11.0405 0.5038 237.3892 43.3616 62.1995 70.8577 4.8562 32.1244 14.5244 70.3630 24.2159 244.2021 41.4991 9.8707 6.7024 1.1843 1.1237
temp: 298.150 k
press: 1.00000 atm
elementType: 6 1 6 7 7 5 6 1 1 1 6 1 17 17
symmnumber: 1
zpe: 254366.7 jmol-1
zpe.correction: 0.096883 hartree
zpe.thermalcorrener: 0.105815 hartree
zpe.thermalcorrenthalpy: 0.106759 hartree
zpe.thermalcorrgfe: 0.060796 hartree
zpe.sumelectzpe: -1210.186387 hartree
zpe.sumelectthermal: -1210.177455 hartree
zpe.sumelectthermalent: -1210.176510 hartree
zpe.sumelectthermalfe: -1210.222474 hartree
dipole: -3.8423 6.4328 -0.8441
dipole: 7.5404
quadrupole: -87.2985 -52.9272 -68.0918
quadrupole: 12.9376 -3.5216 0.7563
quadrupole: -17.8593 16.5120 1.3473 12.9376 -3.5216 0.7563
hfenergy: -1210.2832698 hartree
pointgroup: C01 [X(C4H5B1Cl2N2)]
dipole: -1.5116906 2.5308715 -0.3320856 debye
dipolederiv: 0.2492652 -0.4141907 0.2019357 -0.3967842 0.5025041 -0.28503 0.2427256 -0.3582927 0.0875775 0.1652592 0.0297582 -0.0038047 0.023559 0.1020358 -0.0644081 -0.0158361 -0.0418376 0.0660777 -0.5486848 0.5689579 -0.2627899 0.5494596 -0.9302522 0.3526698 -0.2952123 0.4154415 -0.3502242 -0.4335471 0.4468812 -0.1004535 0.3182047 -0.713245 0.0151021 -0.3536663 0.4662885 -0.4458195 -0.3225977 0.0219575 0.0360085 0.0923838 -0.5104432 -0.0427768 0.147064 -0.2483947 -0.281867 0.9499352 -0.906478 0.4302163 -0.8605869 2.0000196 0.2104243 0.5099254 0.0693951 1.9607783 0.3823026 -0.2238352 -0.0002883 -0.2381451 0.6336503 -0.056724 0.0048366 -0.0597218 0.1690942 0.0759707 0.0485377 -0.0204322 0.0245398 0.0477593 -0.0431995 -0.0723599 0.0496219 -0.0662758 -0.0456804 0.0849586 0.0597415 0.0166529 -0.01514 0.0528916 0.1101414 -0.0161665 0.0314163 -0.0143499 -0.0726361 -0.0399862 0.0277518 -0.0924139 -0.0049036 -0.0274889 -0.0495206 0.0907863 0.0329872 -0.0922931 -0.1092612 -0.0419419 0.2895247 0.3317134 -0.0163657 0.1685669 0.2534783 0.1183164 0.0522239 -0.0637857 0.0567068 0.0873714 0.0401176 -0.0601623 0.0281594 0.0315289 -0.3467948 0.4017664 0.0796604 0.4304015 -1.0922277 -0.2590524 0.1278804 -0.3463792 -0.3414361 -0.2623819 0.0543917 -0.2067606 -0.0022019 -0.3091433 -0.2468243 -0.3014819 -0.0771603 -1.2051149 unknown
polarizability: 90.0023396|-32.601949|124.0989145|17.2364093|-1.7702434|115.6896643 unknown
InChI: InChI=1/C4H5BCl2N2/c1-9-2-4(5(6)7)8-3-9/h2-3H,1H3
charge 0 multiplicity 1
14 atoms
C  2.65074011 1.58723782 1.09526765
H  2.66439576 2.11788707 2.03436063
C  3.20020701 0.37362885 0.72518544
N  2.02170327 2.08004379 0.00039159
N  2.8969935 0.13348626 -0.60884721
B  4.009949 -0.57290975 1.60128877
C  1.28850382 3.33139608 -0.09302998
H  0.95086836 3.46343116 -1.11989925
H  0.42034756 3.31142816 0.56669277
H  1.93544319 4.16639808 0.17698147
C  2.20188808 1.16145198 -0.99942379
H  1.79338773 1.31657885 -1.98795216
Cl 4.64448012 -2.09516407 0.99027186
Cl 4.34322153 -0.16265522 3.29500318
