program: Gaussian 16
title: cl_xanthene
version: AS64L-G16RevC.02
method: RwB97XD
basis: GenECP
operation: Freq
keyword: #N
keyword: Geom=AllCheck
keyword: Guess=TCheck
keyword: SCRF=Check
keyword: GenChk
keyword: RwB97XD/GenECP
keyword: Freq
converged: YES YES YES YES
title: Mulliken charges:
elementType: C C C C C C H H H C O C H H H C H H H C C C C C H C H H B N C H H H C H H H Cl Cl
charge: 0.873989 -0.573910 -0.777585 -0.211354 0.215111 0.183954 0.190347 0.249737 0.182529 -0.230699 -0.068540 -0.409637 0.173482 0.169903 0.196938 -0.788843 0.183727 0.189788 0.195332 0.350100 -0.023818 -0.090292 -0.028342 -0.606335 0.162702 -0.380816 0.249000 0.173524 -0.403477 0.234473 -0.416715 0.166732 0.172912 0.132937 -0.319501 0.180499 0.144438 0.170789 0.136431 0.050491
chargesum: -0.00000
title: Mulliken charges with hydrogens summed into heavy atoms:
elementType: C C C C C C C O C C C C C C C C B N C C Cl Cl
charge: 0.873989 -0.383562 -0.527848 -0.028826 0.215111 0.183954 -0.230699 -0.068540 0.130685 -0.219996 0.350100 -0.023818 0.072410 -0.028342 -0.357335 -0.207292 -0.403477 0.234473 0.055866 0.176225 0.136431 0.050491
chargesum: 0.00000
1716.lowfreq: -7.3618 -5.0615 -0.0016 0.0020 0.0020 8.7098 20.7355 30.9836 53.8963
frequency: 20.5440 30.9189 53.8908 60.4478 97.3219 109.7204 134.1265 152.7006 160.4341 179.2038 209.7188 223.3110 249.7047 252.2255 258.5805 295.9125 303.6534 305.9123 313.0554 332.4406 352.0823 364.5529 374.0862 393.5677 400.1910 423.6600 455.6675 504.8926 517.5942 543.2426 559.6946 569.2266 579.6073 593.7416 622.0055 659.6234 669.4901 688.4620 765.4835 767.5875 781.8028 819.2193 824.8909 840.7260 865.4670 898.0775 912.1868 921.9331 937.8133 959.0937 963.2937 994.5913 1006.7467 1011.3313 1030.0324 1036.1066 1086.2696 1114.3203 1122.6077 1126.6468 1154.7434 1170.8562 1178.7906 1190.5482 1200.1593 1222.2754 1231.6415 1246.4100 1271.7530 1275.4947 1295.6067 1298.2247 1314.6792 1339.6643 1346.3886 1379.4705 1402.7432 1425.0316 1450.7496 1463.6822 1477.4870 1484.5426 1485.5489 1488.5549 1497.9961 1500.7888 1506.1845 1513.2430 1517.5176 1519.8667 1524.3115 1538.8119 1646.1640 1658.8742 1664.0440 1684.1183 2961.5062 2970.7720 3041.0804 3054.2774 3087.1924 3096.3801 3121.1790 3132.1564 3132.2990 3136.0063 3137.0669 3171.8949 3195.6574 3196.5541 3211.1315 3221.4661 3225.5163 3227.8383
redmass: 17.4663 6.2732 4.3812 4.1520 7.8580 3.2920 5.0683 3.7248 3.5745 2.9283 6.3303 1.4554 2.0040 2.9468 1.9122 2.3958 1.5858 2.2984 1.6406 2.0972 3.9716 1.8840 5.6187 3.2254 4.7250 4.1328 4.1973 5.4466 4.3760 4.5672 4.0668 4.0031 4.3605 4.5118 5.2709 4.6900 5.9964 6.1630 1.5721 3.9850 1.8270 2.4976 3.6564 5.8332 3.8847 5.9191 1.4673 7.3344 2.5475 1.4366 1.7347 1.3132 2.6997 1.4379 1.3279 2.3280 1.4416 1.8605 2.1642 1.4243 1.8625 2.3812 1.4605 2.5513 1.3011 1.5051 2.1892 3.4368 3.7345 3.1101 2.1822 3.4535 2.5347 6.3935 5.3345 3.0368 1.2369 1.2400 1.1734 3.0861 1.1951 1.0517 1.1258 1.1252 1.1056 1.0643 1.3198 1.6818 1.7765 1.2047 1.3322 2.1436 5.5482 6.8117 7.0317 8.1351 1.0570 1.0572 1.0346 1.0365 1.0761 1.0817 1.1035 1.1011 1.1029 1.1032 1.1040 1.0988 1.0880 1.0874 1.0926 1.0914 1.0953 1.0949
irintensity: 0.7313 0.1565 0.5424 0.9198 0.6605 1.4242 0.3446 0.5687 0.3571 2.2098 1.1350 0.1328 0.5983 0.5601 1.7304 1.4562 0.5460 1.2098 1.1729 1.8958 1.5885 0.1642 1.0977 2.5964 0.7242 1.1642 2.5170 9.2389 1.6603 6.6923 7.5715 8.0659 7.3792 10.8586 1.4195 3.7943 24.3434 6.8844 42.8878 71.3818 56.4749 8.3453 19.4516 17.7829 6.8442 47.9985 6.9674 370.8579 30.3363 11.5988 23.3357 0.9663 133.0785 11.9573 1.3355 24.7725 16.5323 26.3852 27.0810 9.3194 30.2735 9.6857 25.5670 40.5639 10.8031 19.0324 20.6148 75.6602 100.0352 382.0323 140.9508 40.8090 5.7600 47.9021 3.4075 77.3023 11.0584 11.9580 16.8412 391.5654 10.9046 1.1030 20.6621 34.5673 14.7808 32.8353 22.3469 6.4823 9.6392 2.9623 20.9648 121.0084 51.2514 55.4396 77.7416 3.9389 102.8437 152.1964 32.5561 24.5180 36.1965 36.5071 22.6118 39.9436 18.2797 29.4903 23.6770 9.1251 8.8365 1.0309 8.9331 8.6440 16.9277 14.1920
temp: 298.150 k
press: 1.00000 atm
elementType: 6 6 6 6 6 6 1 1 1 6 8 6 1 1 1 6 1 1 1 6 6 6 6 6 1 6 1 1 5 7 6 1 1 1 6 1 1 1 17 17
symmnumber: 1
zpe: 841503.4 jmol-1
zpe.correction: 0.320512 hartree
zpe.thermalcorrener: 0.340757 hartree
zpe.thermalcorrenthalpy: 0.341701 hartree
zpe.thermalcorrgfe: 0.271241 hartree
zpe.sumelectzpe: -1733.607275 hartree
zpe.sumelectthermal: -1733.587030 hartree
zpe.sumelectthermalent: -1733.586086 hartree
zpe.sumelectthermalfe: -1733.656546 hartree
dipole: 0.8704 2.7911 -1.2390
dipole: 3.1753
quadrupole: -134.1877 -128.8640 -142.8834
quadrupole: -2.0941 10.5700 -3.6146
quadrupole: 1.1240 6.4477 -7.5717 -2.0941 10.5700 -3.6146
hfenergy: -1733.9277872 hartree
pointgroup: C01 [X(C17H18B1Cl2N1O1)]
dipole: 0.342425 1.0980871 -0.4874753 debye
polarizability: 310.0827787|24.9802925|298.2423212|26.0797133|-48.183212|238.6925677 unknown
InChI: InChI=1/C17H18BCl2NO/c1-17(2)11-7-5-9-13(18(19)20)15(11)22-16-12(17)8-6-10-14(16)21(3)4/h5-10H,1-4H3
charge 0 multiplicity 1
40 atoms
C  -2.0917342 1.4188847 1.01775848
C  -0.71777566 1.24482987 1.2378213
C  0.1899978 2.2445566 0.93195334
C  -0.2596031 3.44318741 0.39063089
C  -1.61132171 3.66286966 0.14709124
C  -2.50275886 2.63426331 0.45316459
H  -0.36154128 0.31050655 1.65681877
H  1.24762844 2.09387818 1.11196251
H  0.46200779 4.21582847 0.15584102
C  -2.19184181 4.97252812 -0.37389945
O  -3.83064666 2.7812286 0.16891658
C  -1.13714562 5.8398464 -1.06267566
H  -1.57846464 6.77778729 -1.40505679
H  -0.34351122 6.10867062 -0.36246305
H  -0.68996001 5.33117155 -1.92046017
C  -2.77165446 5.75870557 0.82617539
H  -1.97455652 6.00690473 1.53269941
H  -3.23312728 6.68630876 0.47662325
H  -3.52989727 5.17740366 1.35540741
C  -3.34025129 4.60550772 -1.30834061
C  -4.14892106 3.53895558 -0.93708129
C  -3.64626198 5.28987593 -2.48451883
C  -5.2924263 3.16064486 -1.66177586
C  -4.74661535 4.91834462 -3.23985608
H  -3.02619529 6.11308847 -2.81457499
C  -5.56942355 3.87687719 -2.82722976
H  -4.97900853 5.45234807 -4.15421378
H  -6.43416426 3.61629856 -3.42378243
B  -3.06709045 0.29356273 1.44343164
N  -6.07242844 2.07588508 -1.21735248
C  -6.7568984 2.30028924 0.05175667
H  -7.59965259 3.00125068 -0.06362138
H  -7.14455799 1.34928273 0.42385968
H  -6.06586947 2.69562061 0.79304498
C  -6.94952565 1.46864587 -2.19945448
H  -7.32723385 0.52874057 -1.79112658
H  -7.81907095 2.09691136 -2.4560914
H  -6.39598653 1.24529425 -3.11315627
Cl -4.58171009 0.59384408 2.28692706
Cl -2.62370828 -1.40162741 1.20324816
