program: Gaussian 16
title: MeQHBN2O4
version: ES64L-G16RevC.01
method: RwB97XD
basis: GenECP
operation: Freq
keyword: #N
keyword: Geom=AllCheck
keyword: Guess=TCheck
keyword: SCRF=Check
keyword: GenChk
keyword: RwB97XD/GenECP
keyword: Freq
converged: YES YES YES YES
title: Mulliken charges:
elementType: C H C N N N B C H H H C O O H C O O H
charge: -0.282845 0.278003 -0.535330 0.187665 0.037336 -0.045196 0.673898 -0.371720 0.219236 0.224524 0.186535 -0.177037 -0.283150 -0.119629 0.310835 -0.256183 -0.231698 -0.118892 0.303646
chargesum: -0.00000
title: Mulliken charges with hydrogens summed into heavy atoms:
elementType: C C N N N B C C O O C O O
charge: -0.004841 -0.535330 0.187665 0.037336 -0.045196 0.673898 0.258575 -0.177037 -0.283150 0.191206 -0.256183 -0.231698 0.184754
chargesum: 0.00000
1716.lowfreq: -11.1372 -7.7897 -6.1494 -0.0009 -0.0005 0.0002 18.8197 39.4656 45.9866
frequency: 17.8180 39.3715 45.6564 54.6003 74.1975 92.6963 109.7361 167.2092 234.1385 256.7945 277.2985 312.5845 410.8461 499.3722 535.4153 620.0097 637.4369 652.6566 676.9479 712.0667 720.3695 744.0592 758.1240 890.4666 923.9982 993.4564 1026.8976 1083.3999 1093.1398 1154.4340 1169.3515 1194.0399 1210.7533 1272.0775 1310.1476 1368.7470 1386.4962 1438.2053 1461.2558 1480.9382 1498.2835 1557.6543 1576.3426 1789.7777 1803.2642 3083.2182 3172.3170 3187.0831 3292.3409 3784.8305 3786.8171
redmass: 11.3363 3.1710 1.4517 4.9654 6.2867 6.1021 7.4835 4.9973 8.0968 5.5164 5.4401 10.2790 3.5997 2.2987 1.8545 2.2053 3.7296 2.4749 4.3634 3.7663 4.1019 6.5941 4.7554 1.4547 8.1929 8.5912 3.6809 3.5890 1.9744 1.3412 2.6198 1.9519 2.5363 2.4122 6.2631 3.6064 3.6463 6.3229 1.2860 1.0370 1.2985 3.5373 5.3320 10.4399 10.5080 1.0322 1.1069 1.1065 1.1023 1.0640 1.0641
irintensity: 4.6220 3.1017 1.1840 10.1878 2.8178 4.2596 0.6584 4.9979 3.7688 7.7164 2.5923 3.8338 11.7117 2.3974 13.8963 150.9827 90.1961 216.6628 26.7398 24.7582 24.8917 26.7849 45.4641 12.8592 71.7786 85.6920 5.3369 3.7315 50.5667 0.4297 322.6504 359.8854 6.8002 39.1536 109.3884 28.6696 133.9665 7.9178 16.2802 15.7723 22.0625 12.6736 189.4475 479.9267 239.2752 20.7713 4.0061 2.9245 5.9732 113.9804 98.4895
temp: 298.150 k
press: 1.00000 atm
elementType: 6 1 6 7 7 7 5 6 1 1 1 6 8 8 1 6 8 8 1
symmnumber: 1
zpe: 344758.6 jmol-1
zpe.correction: 0.131312 hartree
zpe.thermalcorrener: 0.144320 hartree
zpe.thermalcorrenthalpy: 0.145264 hartree
zpe.thermalcorrgfe: 0.088103 hartree
zpe.sumelectzpe: -683.993190 hartree
zpe.sumelectthermal: -683.980181 hartree
zpe.sumelectthermalent: -683.979237 hartree
zpe.sumelectthermalfe: -684.036398 hartree
dipole: -2.1839 4.7879 2.4807
dipole: 5.8178
quadrupole: -89.2839 -48.8653 -75.9899
quadrupole: 8.0787 14.8377 4.4654
quadrupole: -17.9042 22.5144 -4.6102 8.0787 14.8377 4.4654
hfenergy: -684.1245014 hartree
pointgroup: C01 [X(C5H6B1N3O4)]
dipole: -0.859226 1.8837026 0.9759745 debye
dipolederiv: 0.2897085 -0.3813023 0.1238839 -0.3615556 0.5178056 -0.2117134 0.1730998 -0.256843 0.1043899 0.1633272 0.0205094 0.0005671 0.0064396 0.1304829 -0.0399721 -0.0058416 -0.0371243 0.1108124 -0.5206472 0.4936098 -0.3268007 0.5070629 -0.7963627 0.2753128 -0.3681045 0.4039813 -0.5204203 -0.2806601 0.3244423 -0.0875435 0.2286705 -0.4510849 -0.001487 -0.2576207 0.2936665 -0.3050405 -0.3097013 0.0723779 -0.308372 0.1894078 -0.1381596 0.5334178 -0.1626364 0.2405003 -0.2004393 -0.1045165 -0.0259031 0.2658803 -0.0117948 -0.3285287 -0.2024845 0.3153871 -0.2531937 0.2408195 0.8559984 -0.5290767 0.2968289 -0.4361088 0.9939263 -0.2978176 0.3071763 -0.3430108 0.7861664 0.3499504 -0.1825145 0.0443615 -0.2299201 0.524186 -0.1089812 0.004096 -0.0377091 0.1643557 0.0355313 0.0039393 0.0618736 0.058272 -0.0025504 0.0419036 0.0298613 0.0907887 0.0190585 -0.0642337 0.0503375 -0.0309151 -0.029056 -0.0154706 0.0102707 -0.0264513 0.0113624 0.1083286 0.0786907 0.0140056 -0.0597993 0.0483058 0.0241207 -0.0094939 -0.017529 -0.0823181 -0.020963 2.0597982 -0.1715323 0.1230377 -0.0354792 0.128796 0.1795375 -0.0530766 0.0927445 1.1591276 -1.087898 0.0887055 0.0896799 0.1031672 -0.366694 -0.1427602 0.4252664 -0.0510693 -1.1643493 -1.50692 0.0605341 -0.2802222 -0.0766447 -0.36791 -0.041979 -0.4910851 0.0599112 -0.5468966 0.3430456 0.0218402 0.1117973 0.0174909 0.3667843 -0.0232955 0.0492306 -0.0297147 0.2713369 1.3648057 0.6381153 -0.5268176 0.2937159 1.641611 0.0481349 -0.5205358 0.0023561 0.4245745 -1.2372431 -0.101434 0.3621344 0.2666542 -0.8966427 -0.1346268 0.5205726 -0.0732854 -0.5957457 -0.6948715 -0.4592703 0.0650534 -0.5345438 -1.3530732 0.1325898 0.0198531 0.0033053 -0.3713258 0.2658354 0.0626162 0.0753724 -0.0040838 0.3887641 -0.0065559 0.0583378 -0.0343479 0.3362106 unknown
polarizability: 114.3295976|-29.7079995|125.2862286|11.619422|-2.6675501|118.991492 unknown
InChI: InChI=1/C5H6BN3O4/c1-9-2-3(7-8-9)6(4(10)11)5(12)13/h2,10,12H,1H3
charge 0 multiplicity 1
19 atoms
C  2.63073427 1.64325648 1.17008286
H  2.65932548 2.17700454 2.10588087
C  3.18682355 0.43301982 0.77863872
N  1.96865472 2.08609706 0.10275335
N  2.08735027 1.21151629 -0.92739972
N  2.80669345 0.23049106 -0.53080882
B  4.02206348 -0.54769968 1.57014309
C  1.18032606 3.29434073 -0.06200794
H  1.56147535 3.85910756 -0.91147714
H  0.13765328 3.02899557 -0.23281733
H  1.2655413 3.88954485 0.84489037
C  4.38040872 -0.23510204 3.09337613
O  3.53266926 -0.03483458 3.93309284
O  5.69019196 -0.22706797 3.3716357
H  5.80200822 -0.03141544 4.31310541
C  4.56689611 -1.88154004 0.90350286
O  5.63178629 -1.89961057 0.33435242
O  3.78267134 -2.95816534 1.03098956
H  4.20982625 -3.70258813 0.58278169
