program: Gaussian 16
title: cyclo_biphenylene
version: AS64L-G16RevC.02
method: RwB97XD
basis: GenECP
operation: Freq
keyword: #N
keyword: Geom=AllCheck
keyword: Guess=TCheck
keyword: SCRF=Check
keyword: GenChk
keyword: RwB97XD/GenECP
keyword: Freq
converged: YES YES NO YES
title: Mulliken charges:
elementType: C C C C C C C H C H H C H C H C C H B N C H H H C H H H C H C H C H H C H H C H H H H
charge: 0.189018 0.210605 0.284103 -0.070793 -0.501144 -0.109283 -0.438089 0.196860 -0.276760 0.234700 0.193078 -0.383230 0.218145 -0.574549 0.232798 -0.106168 0.382412 0.194035 -0.450275 0.283885 -0.382213 0.158739 0.173751 0.180195 -0.509642 0.181954 0.206849 0.122888 -0.228290 0.235673 -0.152600 0.179269 -0.727497 0.180846 0.154139 -0.524456 0.161877 0.182079 -0.132085 0.217053 0.115003 0.267631 0.229487
chargesum: -0.00000
title: Mulliken charges with hydrogens summed into heavy atoms:
elementType: C C C C C C C C C C C C B N C C C C C C C
charge: 0.189018 0.210605 0.284103 -0.070793 -0.304284 -0.109283 -0.203389 -0.083682 -0.165086 -0.341751 0.087867 0.382412 -0.450275 0.283885 0.130473 0.002049 0.275014 0.256156 -0.392512 -0.180501 0.199971
1716.lowfreq: -6.6569 -1.0919 -0.0005 -0.0004 -0.0003 5.3772 36.8529 52.0878 58.9634
frequency: 36.8521 52.0867 58.9537 82.7766 98.8407 116.4286 130.2502 157.6502 171.5443 191.3287 218.9746 229.3636 258.5771 282.6159 295.8546 308.7582 327.0754 349.2959 363.7903 371.4556 395.6985 418.4691 464.9718 475.4290 488.1615 514.4927 561.2554 570.6258 572.5919 606.3607 633.1141 648.3772 660.5033 730.4661 735.2632 744.5080 778.4949 790.6177 824.6361 835.2180 837.2103 858.2977 863.4655 905.9198 917.0614 925.6020 936.0450 985.0190 990.9081 999.8558 1002.2154 1010.7281 1040.4220 1046.6175 1054.4413 1066.9895 1076.0944 1085.8520 1092.6696 1122.6830 1136.6267 1142.1385 1166.6826 1174.8411 1176.5363 1190.8163 1194.1552 1215.0978 1216.3508 1237.8259 1244.5665 1280.4258 1290.5771 1298.8103 1313.6617 1344.2543 1362.2566 1369.1790 1382.1225 1383.9243 1385.2740 1404.2466 1421.4326 1433.3341 1442.3804 1450.9771 1476.0253 1486.2116 1493.7625 1494.5046 1495.7437 1500.7137 1504.7684 1507.7172 1512.1595 1520.6464 1533.6897 1645.8755 1662.2656 1673.2882 1737.8444 2973.7068 2978.1692 2981.8806 2989.6782 3014.7502 3025.2400 3027.2734 3058.3741 3061.3429 3069.7928 3074.5567 3077.8157 3091.7986 3092.5005 3138.8121 3153.3496 3172.9094 3189.7796 3194.5037 3210.9599 3215.1224 3220.7646
redmass: 3.8798 3.0170 3.6549 3.1139 3.7097 4.2156 2.4487 2.8866 3.2736 2.1336 1.3360 3.2938 2.6182 2.3198 1.8137 2.2503 1.6512 3.7388 3.5602 3.1565 2.3724 2.3340 4.1661 3.1364 2.9103 4.0660 3.5416 3.5756 1.8121 5.9800 4.0936 5.3627 3.1861 4.4149 3.6405 4.1774 1.4908 1.5712 3.1927 3.9239 2.1694 3.3309 1.3419 1.3894 2.7522 2.5991 1.4451 3.3089 1.3148 1.4880 4.3197 2.9812 1.6630 1.9859 2.0972 1.1244 1.6518 1.4292 1.9744 1.2686 1.7337 2.3373 1.8171 1.4956 1.6926 1.8602 1.3285 2.2265 2.9148 1.5975 1.7055 1.2486 2.0932 2.3605 1.8446 1.7559 1.9478 1.3778 1.5840 2.3938 1.5593 2.3423 1.1108 1.1166 2.3556 1.2275 1.2575 1.0783 1.0708 1.1071 2.0134 1.1912 1.0661 1.0959 1.4016 6.3504 1.4782 8.8380 8.9671 7.0704 8.4911 1.0563 1.0701 1.0662 1.0577 1.0682 1.0632 1.0626 1.0862 1.0865 1.1014 1.0975 1.0994 1.0814 1.0813 1.1040 1.0999 1.0871 1.0878 1.0920 1.0962 1.0921 1.0957
irintensity: 0.1235 0.4915 0.2866 1.6302 4.5099 0.8795 2.0552 2.3916 0.5481 1.2247 1.0255 0.2144 0.3590 1.1403 5.4427 1.4304 0.3058 0.1364 5.5919 0.2130 0.8000 0.8285 4.8318 2.6221 0.7975 2.2785 2.0576 6.7119 3.2542 1.0149 2.2160 1.7458 9.4904 7.1234 19.8473 12.7299 2.9400 116.4324 2.4264 6.8678 11.9266 14.6214 1.9847 0.8751 9.2634 7.3691 3.4382 57.8945 1.3148 3.4226 12.8957 3.6765 6.2659 3.9630 6.8080 4.5133 17.9862 11.9142 7.1515 4.5822 8.8552 21.9127 64.8471 15.0158 27.6602 31.3249 10.5365 4.8351 6.9974 3.2434 9.0895 0.2554 5.0028 25.8605 24.3404 64.4494 81.7794 5.4906 26.7051 84.7661 1.4922 36.9924 9.2184 3.0639 17.3663 3.0859 18.9227 9.8513 15.2905 9.2220 2.9741 48.0009 9.0307 2.1270 7.8765 5.3830 126.0777 33.2133 32.9096 123.2382 35.7321 148.1750 25.9533 24.1223 79.7347 29.8466 46.4911 65.8997 42.4947 37.1318 34.8743 87.4388 106.1644 52.4330 13.1050 19.4765 15.4884 9.0159 9.1562 21.3241 24.9173 13.4740 19.3038
temp: 298.150 k
press: 1.00000 atm
elementType: 6 6 6 6 6 6 6 1 6 1 1 6 1 6 1 6 6 1 5 7 6 1 1 1 6 1 1 1 6 1 6 1 6 1 1 6 1 1 6 1 1 1 1
symmnumber: 1
zpe: 964708.2 jmol-1
zpe.correction: 0.367438 hartree
zpe.thermalcorrener: 0.386146 hartree
zpe.thermalcorrenthalpy: 0.387090 hartree
zpe.thermalcorrgfe: 0.321130 hartree
zpe.sumelectzpe: -816.395978 hartree
zpe.sumelectthermal: -816.377270 hartree
zpe.sumelectthermalent: -816.376326 hartree
zpe.sumelectthermalfe: -816.442286 hartree
dipole: -0.8432 0.8705 1.4548
dipole: 1.8935
quadrupole: -132.6761 -112.3161 -115.0410
quadrupole: -6.3778 0.7926 8.2655
quadrupole: -12.6650 7.6950 4.9701 -6.3778 0.7926 8.2655
hfenergy: -816.7634159 hartree
pointgroup: C01 [X(C19H22B1N1)]
dipole: -0.3317462 0.3424973 0.5723816 debye
polarizability: 199.9128163|-55.6767344|336.7504018|16.2830719|5.9684241|321.1761632 unknown
InChI: InChI=1/C19H22BN/c1-21(2)17-11-7-9-15-14-8-6-10-16(18(14)19(15)17)20-12-4-3-5-13-20/h6-11H,3-5,12-13H2,1-2H3
charge 0 multiplicity 1
43 atoms
C  1.94333073 2.44495883 -0.38542925
C  1.69024528 2.5350538 -1.77637251
C  1.22207147 3.95752841 -1.59689105
C  1.42248445 3.84958262 -0.20371468
C  0.79111712 5.1042701 -2.20489977
C  1.11760281 4.87163491 0.67287329
C  0.53477548 6.18027711 -1.32768423
H  0.65173988 5.20233188 -3.2741871
C  0.67901717 6.07124936 0.0447023
H  0.19108304 7.12478425 -1.73562594
H  0.43104287 6.93097506 0.65452341
C  1.93632365 1.50167754 -2.63204748
H  1.75807146 1.55272478 -3.6997022
C  2.45131823 0.32463312 -2.03180534
H  2.65661878 -0.53840311 -2.65587395
C  2.70661904 0.24909109 -0.67636124
C  2.4902183 1.33891605 0.22349761
H  3.11400908 -0.67716609 -0.28179139
B  2.95687054 1.26807097 1.7194343
N  1.23128746 4.72630038 2.06158061
C  1.09730078 5.91550116 2.87897462
H  0.06718863 6.30570581 2.90751582
H  1.39320551 5.66948874 3.90084643
H  1.76213147 6.7010943 2.51645752
C  0.53704723 3.57727572 2.62541584
H  0.94354268 3.35185082 3.61460044
H  -0.54360781 3.76232177 2.7215975
H  0.67117333 2.6987062 1.99468152
C  3.81373501 2.44557029 2.30554379
H  4.56639646 2.76848902 1.57618474
C  2.51211001 0.07827476 2.64494415
H  2.48062024 -0.87742992 2.1081743
C  3.26907958 -0.03433273 3.97539868
H  2.71370937 -0.65848508 4.68299493
H  4.22861436 -0.53915385 3.80713799
C  4.44250466 2.19004122 3.68414192
H  5.39554798 1.66175752 3.55627711
H  4.68405157 3.1373108 4.17740373
C  3.54701621 1.34030863 4.58903119
H  4.01706922 1.22186285 5.57060352
H  2.59457222 1.86138442 4.75988715
H  3.12334749 3.30600044 2.35367279
H  1.44996354 0.30196321 2.85021965
