program: Gaussian 09
title: 000075846
version: EM64L-G09RevD.01
frameworkgroup: C1[X(C10H8N2S2)]
method: RPBEPBE
basis: SDD
operation: Freq
keyword: #p
keyword: freq=noraman
keyword: PBEPBE/SDD
title: #p freq=noraman PBEPBE/SDD
converged: YES YES NO NO
title: Mulliken charges:
elementType: S S N N C C C C C C C C C C H H H H H H H H
charge: 0.058652 0.057871 -0.008065 -0.008006 -0.054009 -0.053507 -0.153188 -0.152398 -0.212213 -0.211729 -0.326519 -0.326784 -0.303457 -0.303482 0.257706 0.257393 0.247036 0.247081 0.246667 0.246689 0.247131 0.247131
chargesum: 0.00000
title: Mulliken charges with hydrogens summed into heavy atoms:
elementType: S S N N C C C C C C C C C C
charge: 0.058652 0.057871 -0.008065 -0.008006 -0.054009 -0.053507 0.104518 0.104995 0.034823 0.035352 -0.079852 -0.080094 -0.056327 -0.056351
polarizability: 2.26200752e+02 -4.19061820e-01 1.27485234e+02 -2.28221925e+01 1.52769152e-01 1.18028743e+02
1716.lowfreq: -17.6822 -12.4529 -0.0017 -0.0012 0.0006 6.9332 8.3691 21.7945 25.1308
frequency: 3.1343 21.5040 25.0551 117.2588 130.4567 173.2264 194.2872 223.3373 320.5909 366.5303 367.6162 388.7870 389.2194 451.1975 490.2023 496.4879 653.4692 653.7469 663.0564 664.2335 730.4847 731.8850 810.1793 813.9223 864.2451 866.4959 952.3024 952.8802 956.3678 956.7974 968.9363 969.1778 1051.9810 1054.1511 1067.8119 1076.6983 1084.9014 1086.2745 1221.3994 1221.9244 1290.7576 1291.2895 1319.6658 1320.8913 1390.4063 1390.9975 1446.0350 1446.7389 1537.0639 1541.2077 1547.0515 1550.6459 3134.8593 3135.0142 3136.8633 3137.3740 3157.5838 3158.0815 3161.7150 3162.6124
redmass: 4.0341 4.2519 6.6451 9.9624 8.1518 8.0584 8.8132 5.5334 8.5674 2.5401 2.5461 13.3504 12.5509 22.5866 3.7101 3.6633 7.0193 7.0041 7.8163 7.8596 3.7815 3.7694 1.3341 1.3451 1.2477 1.2472 4.4584 4.4153 1.5168 1.5109 1.4725 1.4695 3.7540 3.8375 2.1622 2.2951 1.6416 1.7000 1.2794 1.2705 3.6150 3.7406 1.8268 1.7770 1.8029 1.8206 1.7971 1.7980 5.3294 5.7716 7.5466 6.6765 1.0872 1.0873 1.0891 1.0890 1.0960 1.0962 1.0984 1.0980
irintensity: 0.0011 0.1499 0.2159 0.0037 0.4067 2.9534 1.6953 0.0247 0.0260 0.0098 0.1316 0.0036 0.1068 0.3011 23.2982 20.7887 3.3843 0.2087 18.3576 49.5786 0.1704 0.0308 74.0347 49.4144 0.0080 0.0894 1.5522 2.0277 0.5396 0.1793 0.0134 0.0292 36.8461 5.3402 1.0333 3.8998 3.7075 0.4505 6.9643 1.8061 8.0556 2.7424 4.8400 0.0183 43.4711 3.4965 42.7317 11.6287 265.8138 36.7298 34.4022 57.1374 16.0028 10.0261 8.7359 6.5341 28.4435 6.6249 7.0148 2.7530
temp: 298.150 k
press: 1.00000 atm
elementType: 16 16 7 7 6 6 6 6 6 6 6 6 6 6 1 1 1 1 1 1 1 1
symmnumber: 1
zpe: 409655.6 jmol-1
zpe.correction: 0.156030 hartree
zpe.thermalcorrener: 0.168646 hartree
zpe.thermalcorrenthalpy: 0.169590 hartree
zpe.thermalcorrgfe: 0.111609 hartree
zpe.sumelectzpe: -1290.481897 hartree
zpe.sumelectthermal: -1290.469280 hartree
zpe.sumelectthermalent: -1290.468336 hartree
zpe.sumelectthermalfe: -1290.526317 hartree
dipole: -0.0083 1.6410 -0.0075
dipole: 1.6410
quadrupole: -105.9376 -104.8991 -89.9605
quadrupole: -0.1633 -13.3822 0.1098
quadrupole: -5.6719 -4.6334 10.3052 -0.1633 -13.3822 0.1098
hfenergy: -1290.6379265 hartree
pointgroup: C01 [X(C10H8N2S2)]
dipole: -0.0215325 -0.4272811 0.4835249 debye
dipolederiv: -0.2368264 -0.0291126 0.1105256 -0.0188791 -0.0727704 0.0475165 0.2411246 0.1164469 -0.0415248 -0.2230931 0.111756 -0.0434335 0.2425872 -0.0336021 0.1208133 -0.047809 0.0468719 -0.0935551 -0.4709998 -0.0766023 0.0101091 -0.1145856 -0.2816954 -0.0221321 0.19595 0.0268424 -0.4260002 -0.4532173 0.0003469 -0.0808459 0.1777132 -0.4295591 0.0576879 -0.146863 0.0040096 -0.293479 0.711098 0.2426849 -0.2969538 0.2597567 0.0352918 -0.1019709 -0.6816792 -0.1586226 0.2800217 0.6492162 -0.2725583 0.2932001 -0.6505641 0.2796008 -0.2255415 0.3586972 -0.1551764 0.0958965 -0.2860038 -0.0460753 0.2174841 -0.0371999 -0.0721558 0.0638845 0.3209163 0.0423505 -0.3827499 -0.2563916 0.2000075 -0.0786598 0.3040904 -0.3846303 0.0973705 -0.0777859 0.1136618 -0.0965413 -0.6080781 -0.1755975 0.0918453 -0.2308039 -0.1645119 0.0568486 0.4011894 0.1368757 -0.0328599 -0.5688171 0.0896133 -0.194906 0.3884188 -0.0288655 0.1386874 -0.2961455 0.0506063 -0.2056475 0.2423109 0.1164136 -0.1453706 0.1695038 0.0184609 -0.0082114 -0.0829645 0.072851 0.3935392 0.2216647 -0.1175606 0.1424316 -0.0506867 0.4024109 0.0116495 0.1832441 -0.0728123 0.0276692 0.3726709 0.2258354 0.0526108 0.2123392 0.0517028 0.0817842 -0.3357376 -0.0711175 0.2646781 0.3447279 0.0780781 0.2209541 -0.3037466 0.2708891 -0.1220484 0.2705638 0.0433371 0.07121 0.0801621 -0.0683908 -0.0582344 -0.0547033 0.0975091 -0.0343256 -0.0722019 -0.0016431 0.0867353 0.0757388 -0.065318 -0.0596477 -0.0787117 0.0878256 -0.0003387 -0.0468969 -0.0323663 0.0984688 0.1637689 -0.0084601 0.0292076 -0.0119554 0.1455251 -0.0192855 -0.0114909 -0.0372099 -0.0536799 0.1648265 0.0170758 -0.0114573 -0.023431 -0.0576377 -0.0088577 -0.0105655 0.0103191 0.1486684 0.0788357 -0.0278388 -0.0088502 -0.0327686 0.1093471 -0.039865 0.0048199 -0.0461363 -0.0877696 0.0799784 -0.0204624 -0.0284336 -0.0074235 -0.094514 -0.0162688 -0.0350025 -0.0105455 0.1151639 -0.0412883 -0.0981322 -0.0680167 -0.1047924 0.0794981 -0.053258 -0.0245369 -0.033357 0.0476309 -0.0402834 -0.0757025 -0.0935589 -0.0341575 0.0418808 -0.0241389 -0.1068261 -0.0451854 0.084125 unknown
polarizability: 219.3711561|24.5152486|125.2533876|24.7277775|-1.2650741|127.0901848 unknown
InChI: InChI=1S/C10H8N2S2/c1-5-11-6-2-9(1)13-14-10-3-7-12-8-4-10/h1-8H
charge 0 multiplicity 1
22 atoms
S  0.663233 -0.596648 2.116671
S  -0.777296 -1.869651 0.935847
N  4.0276 0.743505 -0.861161
N  -3.953512 1.048343 -0.902601
C  1.949935 -0.116629 0.881534
C  -1.989607 -0.654321 0.253467
C  1.876991 -0.383974 -0.500957
C  -1.853667 0.746872 0.332468
C  3.072026 0.580667 1.392534
C  -3.117734 -1.203676 -0.403613
C  2.936393 0.06494 -1.323889
C  -2.858159 1.548708 -0.258213
C  4.074398 0.986994 0.481521
C  -4.06186 -0.311369 -0.962653
H  1.033418 -0.933084 -0.930665
H  -1.004089 1.208661 0.844998
H  3.178534 0.804283 2.459102
H  -3.272838 -2.284716 -0.482257
H  2.913073 -0.125562 -2.402592
H  -2.785141 2.641087 -0.215855
H  4.956203 1.528319 0.841995
H  -4.946802 -0.701349 -1.47778
