program: Gaussian 16
title: MeQHBCCH
version: ES64L-G16RevC.01
method: RwB97XD
basis: GenECP
operation: Freq
keyword: #N
keyword: Geom=AllCheck
keyword: Guess=TCheck
keyword: SCRF=Check
keyword: GenChk
keyword: RwB97XD/GenECP
keyword: Freq
converged: YES YES YES YES
title: Mulliken charges:
elementType: C H C N N N B C H H H C C H C C H
charge: -0.264091 0.279732 -0.706616 0.212435 0.063417 -0.139269 0.429040 -0.363514 0.218231 0.208798 0.183543 0.067173 -0.377449 0.309000 0.309305 -0.734578 0.304843
chargesum: -0.00000
title: Mulliken charges with hydrogens summed into heavy atoms:
elementType: C C N N N B C C C C C
charge: 0.015641 -0.706616 0.212435 0.063417 -0.139269 0.429040 0.247058 0.067173 -0.068450 0.309305 -0.429735
chargesum: 0.00000
1716.lowfreq: -8.0544 0.0004 0.0006 0.0007 5.9734 17.0324 50.5468 58.5577 87.2334
frequency: 50.3073 58.4633 87.1928 103.8921 106.9576 191.8077 247.9239 280.0138 296.9613 368.9982 406.7102 463.8622 520.1631 614.2045 677.4741 698.0163 705.2307 713.8114 744.6401 787.7938 794.3320 881.7349 925.0059 1035.1506 1083.4337 1092.0636 1106.7972 1153.1497 1200.5051 1280.3798 1318.8269 1419.5111 1457.1017 1486.3117 1492.4579 1542.7271 1569.7024 2180.8969 2186.4241 3078.7111 3165.1274 3188.9288 3290.9368 3461.2932 3463.0884
redmass: 1.0547 4.4896 4.5402 4.4693 4.2688 3.8526 4.6178 5.6719 4.6785 4.2127 5.7954 5.3443 6.6954 6.0253 5.1750 1.3149 1.3117 4.5483 7.7323 1.3267 1.3273 1.4472 8.0080 3.2876 3.6910 2.0505 6.3445 1.3578 2.8830 2.9579 10.9777 6.9657 1.2979 1.0481 1.3808 2.7818 5.2926 5.8373 5.8768 1.0338 1.1047 1.1062 1.1016 1.1636 1.1636
irintensity: 0.4161 13.8228 3.0357 0.0516 2.3714 3.4681 1.9493 6.6394 0.0134 7.5334 2.4810 2.9098 6.9892 18.1749 28.1443 48.9669 66.7962 5.2048 11.2187 38.3651 39.0611 15.6953 184.5983 16.5378 13.2938 41.5726 262.5316 9.4636 167.2248 43.2189 154.6166 20.2148 8.7357 22.8307 33.2185 4.5844 262.3836 74.3087 189.0893 30.5116 6.7266 1.9665 3.0759 58.0901 49.1338
temp: 298.150 k
press: 1.00000 atm
elementType: 6 1 6 7 7 7 5 6 1 1 1 6 6 1 6 6 1
symmnumber: 1
zpe: 316884.9 jmol-1
zpe.correction: 0.120695 hartree
zpe.thermalcorrener: 0.131595 hartree
zpe.thermalcorrenthalpy: 0.132540 hartree
zpe.thermalcorrgfe: 0.082924 hartree
zpe.sumelectzpe: -459.152936 hartree
zpe.sumelectthermal: -459.142035 hartree
zpe.sumelectthermalent: -459.141091 hartree
zpe.sumelectthermalfe: -459.190707 hartree
dipole: -1.2754 4.3700 3.3681
dipole: 5.6628
quadrupole: -67.5846 -42.5795 -56.8051
quadrupole: 3.6316 8.9064 7.7337
quadrupole: -11.9282 13.0769 -1.1487 3.6316 8.9064 7.7337
hfenergy: -459.2736309 hartree
pointgroup: C01 [X(C7H6B1N3)]
dipole: -0.5017916 1.7192718 1.3251092 debye
dipolederiv: 0.2676682 -0.4042186 0.1182772 -0.3507175 0.5006363 -0.1691675 0.1507555 -0.2257243 0.0504793 0.1681751 0.0207159 -0.00121 0.0138497 0.1261587 -0.0531031 -0.0100472 -0.04097 0.0889203 -0.5426457 0.5160149 -0.2918851 0.4752523 -0.8239886 0.248262 -0.3584942 0.3381144 -0.5573951 -0.3392618 0.4496772 -0.0794597 0.2310436 -0.498045 -0.0295616 -0.2388771 0.2974912 -0.2722398 -0.3437712 0.0768102 -0.3452863 0.1886048 -0.1364465 0.5674524 -0.1787984 0.2566118 -0.2446344 -0.102131 -0.0267925 0.2824799 -0.0161343 -0.3385979 -0.2079231 0.3209652 -0.2460811 0.2351403 1.0572192 -0.7329223 0.3784756 -0.709139 1.8126516 0.1438508 0.409539 0.0849259 1.7761275 0.3627768 -0.2571346 0.0260892 -0.1825908 0.5704352 -0.0998472 -0.0169078 -0.0496762 0.1631021 -0.0263123 -0.0492031 0.0338065 0.0423097 -0.1006557 0.0481284 0.0246461 0.0490116 0.0896443 0.0246646 0.0450472 -0.0564033 -0.0239521 0.0339372 -0.0401525 -0.0900763 0.0171476 0.0515345 0.0644307 0.0677891 0.0208446 0.043347 0.0205667 0.0337722 0.0747286 -0.0461079 -0.0409189 -0.3638702 0.2711159 0.0987171 0.2906555 -0.9359452 -0.3006541 0.1357402 -0.362335 -0.4546757 -0.1903132 0.0237029 -0.0218193 0.0215203 -0.1946393 0.019852 -0.0228865 0.0209983 -0.1998841 0.2409498 -0.023078 0.0123581 -0.0218308 0.2637288 0.0045827 0.0135381 0.0030962 0.2651324 -0.3215439 0.0129262 -0.1758164 -0.0069189 -0.3309635 -0.1487243 -0.2070211 -0.0937984 -0.975666 -0.1979973 0.0304693 -0.0074205 0.021865 -0.2301183 -0.0243879 -0.0218956 -0.0010075 -0.240597 0.241962 -0.0209198 0.0082526 -0.0171645 0.2612856 0.0076206 0.0150914 -0.0016967 0.2659304 unknown
polarizability: 100.3713534|-39.7759053|146.5112608|20.1463608|10.2018505|143.0895879 unknown
InChI: InChI=1/C7H6BN3/c1-4-8(5-2)7-6-11(3)10-9-7/h1-2,6H,3H3
charge 0 multiplicity 1
17 atoms
C  2.60875344 1.61308546 1.16961268
H  2.65250362 2.12367227 2.11778681
C  3.15437817 0.41381154 0.74234573
N  1.94197912 2.09411593 0.11629374
N  2.05443734 1.2529414 -0.93642278
N  2.77142505 0.25336289 -0.56912036
B  4.01550399 -0.58306204 1.52660998
C  1.21608341 3.34294871 -0.02226267
H  1.88832611 4.13510161 -0.35374679
H  0.42945775 3.19806988 -0.75984963
H  0.77572055 3.60762861 0.93767781
C  4.52936393 -1.86418719 0.88606253
C  4.94215211 -2.882156 0.38690411
H  5.30224969 -3.77907263 -0.06240945
C  4.36617953 -0.28128863 2.98385367
C  4.63788273 -0.03430145 4.13363343
H  4.88440423 0.17264649 5.14987113
