program: Gaussian 16
title: f_benzopiperidine
version: ES64L-G16RevC.02
method: RwB97XD
basis: GenECP
operation: Freq
keyword: #N
keyword: Geom=AllCheck
keyword: Guess=TCheck
keyword: SCRF=Check
keyword: GenChk
keyword: RwB97XD/GenECP
keyword: Freq
converged: YES YES YES YES
title: Mulliken charges:
elementType: C C C C C C H H H H B C C C C C H H H H H H N H H H H F F
charge: -0.466254 -0.032814 -0.406136 -0.394987 0.046337 -0.277206 0.211680 0.237779 0.192284 0.243009 0.280496 -0.104055 -0.381836 -0.566771 -0.394937 -0.324185 0.195738 0.179688 0.188909 0.175697 0.193307 0.150539 0.367806 0.139361 0.198202 0.166032 0.177118 0.021371 -0.016174
chargesum: -0.00000
title: Mulliken charges with hydrogens summed into heavy atoms:
elementType: C C C C C C B C C C C C N F F
charge: -0.254574 0.204965 -0.406136 -0.394987 0.238621 -0.034197 0.280496 0.239095 -0.044274 -0.191344 -0.030331 0.019661 0.367806 0.021371 -0.016174
chargesum: 0.00000
1716.lowfreq: 0.0003 0.0004 0.0005 6.4227 8.4741 10.3893 41.6465 76.4922 79.6580
frequency: 41.6241 76.4364 79.6481 106.1007 141.1606 180.5856 243.3364 266.3638 280.2628 311.5960 328.1110 371.8740 416.0815 441.0456 464.4011 507.9573 522.0440 559.5364 575.6104 631.6729 663.0227 712.9415 775.1406 782.6732 799.3035 831.3988 860.9927 876.6473 896.2699 939.3976 955.2095 985.8573 995.4636 1022.7701 1049.5803 1057.1328 1072.9176 1092.5041 1095.8828 1146.2528 1161.6474 1170.3336 1187.1486 1200.4070 1258.3376 1265.5127 1279.7097 1300.2000 1309.4568 1317.6344 1327.1525 1359.8865 1361.5450 1389.3131 1395.5345 1397.7142 1402.3591 1429.8520 1480.4925 1487.3001 1491.1431 1496.5149 1501.3549 1512.2057 1535.6278 1631.9701 1668.6142 2936.6416 2941.7398 3028.8200 3048.4263 3058.0845 3091.6783 3099.4219 3107.0746 3109.6714 3142.7691 3188.5103 3198.4463 3216.1692 3227.8264
redmass: 9.0783 3.8923 4.2370 4.2093 5.3631 4.9583 3.1329 2.3231 4.9076 3.0743 4.2600 5.5513 2.0584 3.6147 2.8944 2.0716 4.9169 3.0804 7.1311 3.5639 5.5401 4.9019 4.1598 1.5102 3.1467 1.4813 2.8422 1.4459 1.4661 2.2821 3.0992 1.3271 1.3742 1.3293 3.2177 5.4434 1.9719 1.5416 1.8740 2.0436 2.1417 1.8882 1.2277 1.1594 2.1904 1.8128 3.8193 1.3098 1.6161 1.5099 2.7519 3.4993 1.4369 1.7027 1.5057 1.5017 1.4842 1.6282 1.0981 1.0849 2.3082 1.1668 1.0931 1.1848 2.2016 5.9472 5.6636 1.0720 1.0739 1.0670 1.0618 1.0612 1.0951 1.1035 1.0912 1.1044 1.0881 1.0871 1.0905 1.0965 1.0937
irintensity: 0.4292 0.7471 0.6607 1.2210 1.3699 0.3702 1.7301 3.2295 0.6583 1.2352 0.7509 2.2838 6.7283 3.4537 0.8945 7.6055 2.4318 18.3362 26.8770 3.3171 65.8656 4.0885 4.5412 31.1240 28.6151 0.9035 1.8237 14.2363 4.4184 2.9147 36.7345 2.8804 1.0248 0.6326 46.4149 57.0242 7.1956 5.5580 30.3029 39.3799 16.1226 7.7106 7.5899 16.2338 150.3332 152.8008 180.8154 12.7999 41.0181 21.0719 157.1391 345.8469 33.0435 22.2122 4.1057 29.4379 3.5639 63.2326 5.2523 11.5310 231.2230 9.3619 2.6771 58.9409 129.0341 67.6355 193.4477 62.0991 119.5379 43.3756 33.3977 33.3518 71.1468 46.2103 16.7985 62.0874 24.5224 5.7985 7.0034 23.1551 6.8589
temp: 298.150 k
press: 1.00000 atm
elementType: 6 6 6 6 6 6 1 1 1 1 5 6 6 6 6 6 1 1 1 1 1 1 7 1 1 1 1 9 9
symmnumber: 1
zpe: 633249.5 jmol-1
zpe.correction: 0.241192 hartree
zpe.thermalcorrener: 0.254023 hartree
zpe.thermalcorrenthalpy: 0.254967 hartree
zpe.thermalcorrgfe: 0.201394 hartree
zpe.sumelectzpe: -706.759001 hartree
zpe.sumelectthermal: -706.746170 hartree
zpe.sumelectthermalent: -706.745226 hartree
zpe.sumelectthermalfe: -706.798800 hartree
dipole: -2.5037 1.9658 -0.3743
dipole: 3.2052
quadrupole: -95.1871 -70.1418 -88.2119
quadrupole: -0.9049 0.7767 -3.5850
quadrupole: -10.6735 14.3718 -3.6983 -0.9049 0.7767 -3.5850
hfenergy: -707.0001931 hartree
pointgroup: C01 [X(C11H14B1F2N1)]
dipole: -0.9850439 0.7734233 -0.1472577 debye
polarizability: 181.7799583|17.634933|191.6292959|1.5161511|-31.4376096|130.5970509 unknown
InChI: InChI=1/C11H14BF2N/c13-12(14)10-6-2-3-7-11(10)15-8-4-1-5-9-15/h2-3,6-7H,1,4-5,8-9H2
charge 0 multiplicity 1
29 atoms
C  -0.60269789 0.95575367 0.70617426
C  0.77660693 1.06141539 0.78533238
C  1.46911221 2.1754009 0.28668726
C  0.72549571 3.24751377 -0.27040756
C  -0.66722365 3.11981136 -0.36254802
C  -1.31675333 1.98934378 0.1126084
H  -1.1114305 0.07935212 1.08911306
H  1.34585434 0.24654651 1.21894462
H  -1.25682335 3.92285456 -0.78489678
H  -2.39708884 1.92823777 0.03408581
B  3.00626474 2.05241007 0.24677708
C  0.66717425 5.26069701 -1.66193539
C  2.09471509 5.18223342 0.29025581
C  1.6456524 6.19116584 -2.37417749
C  3.11824658 6.10920598 -0.35078708
C  2.44575457 7.02273033 -1.37388425
H  1.08752203 6.83809349 -3.05725603
H  2.32804269 5.58424068 -2.97876974
H  3.60794439 6.69738527 0.43082076
H  3.88487821 5.50034742 -0.83931726
H  3.18908928 7.6348473 -1.89174496
H  1.76924452 7.71322715 -0.85386153
N  1.37831475 4.40155674 -0.72388264
H  2.57880879 4.50938578 0.99582966
H  1.36665028 5.78139026 0.86699112
H  -0.10076288 5.86714985 -1.14734328
H  0.15792158 4.63202558 -2.39497666
F  3.82930464 2.84176326 -0.43969252
F  3.61893862 1.05382026 0.89586606
