program: Gaussian 16
title: f_biphenylene
version: ES64L-G16RevC.02
method: RwB97XD
basis: GenECP
operation: Freq
keyword: #N
keyword: Geom=AllCheck
keyword: Guess=TCheck
keyword: SCRF=Check
keyword: GenChk
keyword: RwB97XD/GenECP
keyword: Freq
converged: YES YES NO YES
title: Mulliken charges:
elementType: C C C C C C C H C H H C H C H C C H B N C H H H C H H H F F
charge: 0.408343 0.333808 -0.005483 -0.253623 -0.462914 -0.285804 -0.287649 0.193161 0.059202 0.238885 0.204558 -0.340153 0.214588 -0.273633 0.233523 -0.196707 -0.558849 0.238814 0.253334 0.185484 -0.371154 0.159023 0.184854 0.162069 -0.459192 0.199060 0.187381 0.047831 0.013127 -0.021885
chargesum: -0.00000
title: Mulliken charges with hydrogens summed into heavy atoms:
elementType: C C C C C C C C C C C C B N C C F F
charge: 0.408343 0.333808 -0.005483 -0.253623 -0.269753 -0.285804 -0.048764 0.263760 -0.125566 -0.040110 0.042107 -0.558849 0.253334 0.185484 0.134792 -0.024919 0.013127 -0.021885
1716.lowfreq: -6.4864 -4.0124 0.0003 0.0007 0.0008 7.6600 47.1843 50.1576 74.6938
frequency: 47.1503 50.1311 74.6900 105.2844 130.9910 136.4049 145.5621 178.7795 208.5151 252.0174 280.9496 288.0994 308.6363 343.9744 350.0720 379.5532 391.5744 451.5032 470.5974 495.1871 551.0520 562.2814 599.8231 610.7770 629.6257 646.7452 692.0940 737.9796 746.5651 780.8683 783.4723 799.9581 838.2802 898.1372 904.2765 947.8739 993.4577 996.8364 1002.6224 1006.5884 1051.3132 1066.3347 1086.6792 1099.0912 1122.3810 1137.6084 1168.8002 1176.4835 1194.0316 1200.5601 1221.8052 1242.1756 1286.1392 1296.6611 1314.8665 1360.0758 1396.4905 1406.9276 1443.5285 1451.2744 1476.1123 1488.0266 1497.4600 1499.8464 1502.8961 1512.6405 1529.7801 1539.2708 1643.4500 1661.1453 1676.7230 1741.6596 2972.7011 2985.1083 3094.9058 3104.1133 3140.6291 3166.1812 3191.0978 3191.3331 3205.0308 3216.0688 3219.5883 3224.5188
redmass: 11.3394 5.2915 4.6846 4.5787 4.2216 4.7467 3.5304 2.7817 1.4038 2.5491 1.7959 3.0181 3.2445 4.4077 5.2964 3.2310 4.7360 5.0601 4.2257 5.1312 5.3576 3.6101 6.7338 6.3624 4.9977 5.6652 6.1475 3.7109 3.3396 1.6213 5.2740 1.7682 4.8992 5.3122 1.4067 1.3930 3.5446 1.3395 5.9165 1.3407 3.1730 2.8145 1.4243 2.2662 1.2830 2.1605 1.4929 1.7306 2.0573 1.3795 2.4339 1.8150 2.9128 4.1783 7.0335 4.2034 2.7753 2.5214 2.2769 1.2598 1.2582 1.0588 1.5438 1.1742 1.2657 1.2988 6.6317 1.8084 8.7828 9.2187 6.7502 8.3460 1.0557 1.0564 1.0780 1.0810 1.1042 1.1009 1.0871 1.0880 1.0929 1.0972 1.0922 1.0955
irintensity: 0.1472 1.0788 0.9117 5.8264 0.3631 0.1866 2.5796 0.8386 1.5607 1.0618 0.5350 9.6215 5.6417 2.0103 0.9180 1.4026 2.0831 6.8794 2.8092 3.5922 28.1298 1.9162 6.3438 2.6039 18.6367 6.0363 38.4326 39.4045 39.3346 1.0657 10.9823 73.6894 3.2627 10.5693 1.0159 2.8222 67.3114 1.9611 28.0264 0.7205 40.0057 12.3854 19.5884 52.4555 6.8718 65.8790 84.1670 21.5506 55.2918 6.7848 11.2799 10.9055 166.4527 194.3336 122.4159 391.2422 183.8688 79.2831 25.4346 12.8325 32.1527 1.2697 11.7039 24.5381 63.8342 3.8368 6.7892 171.3312 155.2259 103.4043 193.6311 37.5650 120.9669 128.2816 37.0265 28.4046 19.8319 17.5891 1.8257 7.6639 11.7879 21.2325 11.1257 14.8749
temp: 298.150 k
press: 1.00000 atm
elementType: 6 6 6 6 6 6 6 1 6 1 1 6 1 6 1 6 6 1 5 7 6 1 1 1 6 1 1 1 9 9
symmnumber: 1
zpe: 610230.1 jmol-1
zpe.correction: 0.232424 hartree
zpe.thermalcorrener: 0.247726 hartree
zpe.thermalcorrenthalpy: 0.248671 hartree
zpe.thermalcorrgfe: 0.189652 hartree
zpe.sumelectzpe: -819.782166 hartree
zpe.sumelectthermal: -819.766864 hartree
zpe.sumelectthermalent: -819.765920 hartree
zpe.sumelectthermalfe: -819.824938 hartree
dipole: -1.3668 1.7937 -1.0528
dipole: 2.4888
quadrupole: -111.1588 -82.9643 -95.7442
quadrupole: -4.1037 -7.4629 5.2071
quadrupole: -14.5364 13.6582 0.8783 -4.1037 -7.4629 5.2071
hfenergy: -820.0145906 hartree
pointgroup: C01 [X(C14H12B1F2N1)]
dipole: -0.5377318 0.7057123 -0.4141882 debye
polarizability: 126.4165456|-39.0102677|297.5939524|-9.3282868|12.1839687|246.3844866 unknown
InChI: InChI=1/C14H12BF2N/c1-18(2)12-8-4-6-10-9-5-3-7-11(15(16)17)13(9)14(10)12/h3-8H,1-2H3
charge 0 multiplicity 1
30 atoms
C  1.87780105 2.47274069 -0.15979015
C  1.82921143 2.53946796 -1.57693876
C  1.54583797 4.01389668 -1.49503917
C  1.53219273 3.93897691 -0.08545786
C  1.38557782 5.17846485 -2.19300007
C  1.263011 5.03768226 0.71416728
C  1.17903359 6.31946193 -1.38982138
H  1.41603477 5.24258537 -3.27310225
C  1.11123993 6.2556967 -0.00905877
H  1.04486809 7.28466022 -1.86628924
H  0.91322721 7.17128914 0.5333007
C  2.04169609 1.45688301 -2.37522533
H  2.00927076 1.50254438 -3.45733738
C  2.32032672 0.23692165 -1.70395913
H  2.48629042 -0.66158477 -2.28718782
C  2.40605084 0.17437497 -0.33200643
C  2.21020241 1.31569453 0.51154768
H  2.64907671 -0.77451711 0.1334933
B  2.50358341 1.2010788 2.01881692
N  1.14452399 4.95870649 2.09731071
C  1.0641475 6.19376873 2.85006259
H  0.10479362 6.71882716 2.71437139
H  1.17340969 5.9595453 3.91062997
H  1.8775971 6.86483964 2.57001671
C  0.25025215 3.92968693 2.60800498
H  0.52405785 3.67670405 3.63373672
H  -0.79616998 4.27158817 2.59393922
H  0.31543009 3.0267052 2.00386639
F  2.71257466 2.25272241 2.804198
F  2.62176055 0.01088877 2.61140857
