program: Gaussian 16
title: MeQMeBF2
version: ES64L-G16RevC.01
method: RwB97XD
basis: GenECP
operation: Freq
keyword: #N
keyword: Geom=AllCheck
keyword: Guess=TCheck
keyword: SCRF=Check
keyword: GenChk
keyword: RwB97XD/GenECP
keyword: Freq
converged: YES YES NO NO
title: Mulliken charges:
elementType: C C N N N B C H H H F F C H H H
charge: 0.140909 -0.632791 0.273020 -0.091603 -0.135737 0.353413 -0.383776 0.217400 0.200010 0.204138 -0.014589 -0.042452 -0.680872 0.211424 0.188812 0.192694
chargesum: -0.00000
title: Mulliken charges with hydrogens summed into heavy atoms:
elementType: C C N N N B C F F C
charge: 0.140909 -0.632791 0.273020 -0.091603 -0.135737 0.353413 0.237772 -0.014589 -0.042452 -0.087942
1716.lowfreq: -20.1033 -10.2081 -0.0007 0.0004 0.0006 8.6688 60.4353 73.6309 102.0678
frequency: 60.2363 73.4719 102.0116 104.5635 131.4311 259.1082 260.8865 272.1207 326.6285 355.4808 515.3288 597.0380 632.8474 693.6794 695.3224 758.3652 767.3272 1001.2455 1031.9972 1064.2108 1081.6747 1152.4306 1214.5908 1238.3350 1275.7212 1326.8016 1379.4725 1420.0869 1447.7393 1456.7595 1475.7566 1483.0697 1491.8723 1499.5295 1548.2409 1618.8172 3054.6029 3070.6050 3117.9481 3149.3936 3174.9747 3188.8147
redmass: 8.0046 1.1159 1.1378 2.6956 7.2520 3.4109 3.6472 3.8266 6.7742 7.9486 4.6500 9.8419 7.5424 7.2565 5.1416 9.8799 4.6237 2.0669 2.4544 1.5169 3.9514 1.3315 3.8220 10.2742 3.6389 9.5892 8.2162 1.3539 2.1250 1.8562 1.3658 1.0403 1.0386 1.1033 3.6639 8.1185 1.0395 1.0340 1.1015 1.1065 1.1000 1.1038
irintensity: 2.3263 0.0121 0.0321 0.7166 2.9778 2.8415 3.6908 0.3222 4.2190 4.2422 2.9395 14.4387 41.9206 8.5776 6.8466 14.6619 17.1651 15.9668 7.2017 1.9074 179.3133 0.1147 111.8792 65.3368 47.6376 361.2535 125.1883 4.3364 62.9508 1.5879 203.4819 0.7368 34.0775 9.7568 137.8008 129.8316 14.5239 24.7627 8.4599 8.4900 1.5732 0.9397
temp: 298.150 k
press: 1.00000 atm
elementType: 6 6 7 7 7 5 6 1 1 1 9 9 6 1 1 1
symmnumber: 1
zpe: 302479.0 jmol-1
zpe.correction: 0.115208 hartree
zpe.thermalcorrener: 0.125097 hartree
zpe.thermalcorrenthalpy: 0.126042 hartree
zpe.thermalcorrgfe: 0.078901 hartree
zpe.sumelectzpe: -544.806993 hartree
zpe.sumelectthermal: -544.797103 hartree
zpe.sumelectthermalent: -544.796159 hartree
zpe.sumelectthermalfe: -544.843300 hartree
dipole: -1.8976 6.2791 2.9829
dipole: 7.2060
quadrupole: -65.5633 -40.2383 -58.8716
quadrupole: 14.5353 4.9377 6.3345
quadrupole: -10.6722 14.6528 -3.9805 14.5353 4.9377 6.3345
hfenergy: -544.9222008 hartree
pointgroup: C01 [X(C4H6B1F2N3)]
dipole: -0.7465653 2.4704038 1.1735826 debye
dipolederiv: 0.1583094 -0.25404 0.0328378 -0.1968863 0.5462128 0.1168 0.1131087 -0.0596819 0.3197342 -0.3911492 0.3438057 -0.1357589 0.271915 -0.7367564 0.0911138 -0.2420958 0.3264997 -0.4994923 -0.1820431 0.2652159 -0.0328422 0.2248679 -0.5793718 -0.0283962 -0.0799986 0.0793299 -0.1980491 -0.2433911 -0.0339674 -0.2343209 0.0171365 0.0700282 0.4224458 -0.1637673 0.2619997 -0.337781 -0.1830473 0.0242718 0.2199546 0.0041056 -0.4130057 -0.2313344 0.1933322 -0.166097 0.1416092 1.236633 -0.7414396 0.3798668 -0.6935668 2.2689929 -0.0778012 0.4489174 -0.2351113 1.8972826 0.3098621 -0.1560862 -0.0031481 -0.148018 0.5362207 -0.0678909 0.0023364 -0.0816227 0.1393554 0.0993802 0.0318247 -0.0206493 0.0032728 0.0776728 -0.0449269 -0.0605261 0.0434816 -0.0046836 -0.0085656 0.0684175 0.0674467 0.0142291 -0.0083593 0.0491211 0.1137916 -0.0151073 0.0232012 -0.0299961 -0.0710307 -0.0306769 0.0145735 -0.0692291 0.0050943 -0.0319231 -0.0345398 0.1039476 -0.4751832 0.3585498 0.0081844 0.3775122 -1.2457276 -0.1363858 0.0372242 -0.2004319 -0.4881343 -0.4631245 0.1388254 -0.2644815 0.0966244 -0.5249807 0.009776 -0.3274932 0.1485504 -1.1640799 0.0900429 0.0476996 0.0076397 0.0230573 -0.003193 -0.0915569 -0.0277577 -0.0168645 -0.0093549 0.0771392 0.0225908 -0.0612961 0.0439564 0.0603116 0.0703194 -0.0279518 0.0017318 0.0212064 0.0707993 -0.0875833 0.0067444 -0.0713448 -0.0537861 -0.0311579 0.0398207 0.0111349 0.0258605 -0.0656662 0.0429459 0.0604994 0.0185654 0.0749706 -0.0552203 0.0129824 -0.0632716 0.029378 unknown
polarizability: 69.2830487|-18.6488007|100.3282103|9.9773821|1.2368742|92.1626315 unknown
InChI: InChI=1/C4H6BF2N3/c1-3-4(5(6)7)8-9-10(3)2/h1-2H3
charge 0 multiplicity 1
16 atoms
C  2.65125399 1.67153358 1.18225273
C  3.09540083 0.41590188 0.79317577
N  2.08374075 2.17576014 0.07273939
N  2.16103983 1.30028991 -0.95370222
N  2.76293015 0.25039947 -0.52808185
B  3.8300139 -0.65962739 1.59621924
C  1.45468084 3.4683056 -0.11011588
H  1.0957019 3.51392235 -1.13570636
H  0.61516678 3.57852135 0.57751842
H  2.17798931 4.2668628 0.06112787
F  4.19180396 -1.82040691 1.06887899
F  4.14343819 -0.47163238 2.88112726
C  2.71128153 2.41626972 2.46810828
H  3.22450032 1.82405641 3.22283341
H  3.24660725 3.36156492 2.34500028
H  1.70566369 2.64474438 2.83120969
