program: Gaussian 16
title: f_indenoPy
version: ES64L-G16RevC.02
method: RwB97XD
basis: GenECP
operation: Freq
keyword: #N
keyword: Geom=AllCheck
keyword: Guess=TCheck
keyword: SCRF=Check
keyword: GenChk
keyword: RwB97XD/GenECP
keyword: Freq
converged: YES YES YES YES
title: Mulliken charges:
elementType: C C C C C C H H H C H H C C C C C H H H N B F F
charge: 0.002480 -0.213761 -0.809019 0.015554 -0.354541 -0.137156 0.244058 0.219316 0.219481 -0.455733 0.217390 0.217377 -0.931135 0.475088 0.195752 0.445618 -0.459474 0.254395 0.245555 0.240305 0.017295 0.331358 0.009981 0.009817
chargesum: -0.00000
title: Mulliken charges with hydrogens summed into heavy atoms:
elementType: C C C C C C C C C C C C N B F F
charge: 0.002480 -0.213761 -0.809019 0.259611 -0.135225 0.082325 -0.020966 -0.931135 0.475088 0.450147 0.691173 -0.219169 0.017295 0.331358 0.009981 0.009817
1716.lowfreq: -4.2084 -0.0008 -0.0007 -0.0002 6.9782 14.5741 38.8437 80.5149 87.0276
frequency: 38.7843 80.4895 87.0004 100.8796 155.0040 235.0786 242.8909 264.8228 296.0938 344.6250 435.4126 437.7357 476.8708 523.1162 560.1775 562.4683 585.5930 588.1573 644.7411 658.6390 695.8233 753.1211 789.3608 796.2074 809.4037 832.7916 862.4388 915.8132 930.4982 961.3795 990.3507 1014.5275 1017.5484 1050.4291 1078.0201 1102.2566 1136.8261 1149.2084 1175.3879 1203.4994 1207.3489 1211.7196 1267.2774 1297.7463 1304.1998 1326.3817 1335.1697 1353.0097 1384.9221 1448.3586 1455.2916 1480.1113 1523.8345 1538.3502 1652.2474 1664.6623 1672.8419 1683.2338 3061.8019 3101.4948 3183.7600 3186.4366 3192.5325 3194.9693 3209.0954 3220.1753
redmass: 10.5896 6.4018 10.0872 5.6506 5.2435 6.5332 2.1766 4.8639 8.9213 5.5647 7.0427 3.8276 2.8846 6.0277 5.5770 4.0053 8.7700 3.6558 6.9555 7.9028 7.5229 3.9947 5.5841 1.2605 1.3609 4.5685 5.4783 6.4301 1.5981 1.5211 1.5299 1.3485 1.4152 5.7777 2.2979 2.3265 1.9707 1.9585 1.1420 1.7756 1.4133 2.1079 2.0555 3.7224 12.3006 2.3325 3.0600 4.4696 2.9530 1.1568 2.5249 2.7507 2.8694 3.5326 6.8927 6.8114 7.5548 8.4821 1.0609 1.1025 1.0874 1.0896 1.0920 1.0921 1.0973 1.0970
irintensity: 0.1169 0.0666 0.4006 3.5613 0.5981 7.6597 7.0201 2.5280 6.7744 2.2312 2.1098 0.1957 0.6661 22.2646 2.7807 0.5994 20.8395 0.0743 37.0716 36.5217 28.1523 17.7959 1.7864 96.1281 1.7585 10.4645 5.3780 10.6470 3.6267 0.4247 0.6377 0.1227 2.2376 3.2303 1.1150 22.7944 24.0174 81.4608 0.0014 44.9757 18.7385 7.0806 0.3010 23.8297 397.7160 10.2583 74.1256 323.9927 8.5422 15.1904 101.9006 8.5936 3.0711 28.3800 36.0799 23.8030 61.9295 2.3648 12.4145 4.2557 2.6794 17.1697 15.4047 13.7531 26.7655 17.6959
temp: 298.150 k
press: 1.00000 atm
elementType: 6 6 6 6 6 6 1 1 1 6 1 1 6 6 6 6 6 1 1 1 7 5 9 9
symmnumber: 1
zpe: 464991.1 jmol-1
zpe.correction: 0.177106 hartree
zpe.thermalcorrener: 0.189051 hartree
zpe.thermalcorrenthalpy: 0.189995 hartree
zpe.thermalcorrgfe: 0.137891 hartree
zpe.sumelectzpe: -741.300529 hartree
zpe.sumelectthermal: -741.288583 hartree
zpe.sumelectthermalent: -741.287639 hartree
zpe.sumelectthermalfe: -741.339744 hartree
dipole: -3.4172 -2.1161 -3.3803
dipole: 5.2518
quadrupole: -103.1197 -76.0769 -94.9141
quadrupole: -12.8584 -6.5060 3.4766
quadrupole: -11.7495 15.2934 -3.5439 -12.8584 -6.5060 3.4766
hfenergy: -741.4776344 hartree
pointgroup: C01[X(C12H8B1F2N1)]
dipole: -1.3444416 -0.8325535 -1.3299114 debye
dipolederiv: -0.1748964 0.2202964 0.0275755 0.1176187 0.0430921 0.1312086 -0.0223069 0.2029899 0.0200639 -0.0555235 -0.148356 -0.0991346 0.156136 -0.0079216 0.1123797 0.0483319 -0.0992023 -0.0311741 -0.3837 -0.0510182 -0.1499896 -0.047566 -0.17766 -0.0203625 -0.1484362 -0.0234809 -0.3162974 -0.1309575 0.1694432 0.0892751 -0.0059754 0.017346 0.0717502 0.0042271 0.1941427 -0.0455008 -0.0056626 -0.114712 0.0445714 0.0226029 -0.1370923 0.0221832 0.1123656 -0.0745917 -0.1091281 0.1211738 -0.0966728 0.1387978 -0.1287615 -0.000808 -0.0198877 0.1220477 0.0028894 -0.0576677 0.0877157 -0.0247762 -0.0526637 -0.0059857 -0.0517349 -0.099417 -0.043769 -0.1114127 0.0634393 0.0365969 0.1096661 -0.0310933 0.1121218 -0.0462152 -0.0198859 -0.0299016 -0.0215223 0.126323 -0.0309139 0.0334103 -0.1080478 0.0022197 0.0931423 -0.0249482 -0.1230822 -0.0031643 0.0609444 0.0496395 -0.0171305 -0.1157652 -0.0061434 0.0721569 -0.0669185 -0.1097698 -0.0747246 0.0931781 0.0711818 0.0449583 0.0136485 0.0477124 0.0093348 0.0135582 -0.0358142 -0.012166 -0.0796793 -0.0609041 -0.0248248 0.0012082 -0.0306397 -0.0302193 -0.0130664 0.048274 0.0144585 0.0923642 0.2004411 0.0402173 0.0781772 -0.4731369 0.7584892 -0.0200369 -0.168191 0.3362806 0.1601071 0.1578211 -0.1949927 0.0526786 0.2083208 -0.6887725 -0.1598057 0.2465856 -0.4399167 -0.0933579 0.3263249 -0.2457443 0.1230815 0.1908966 -0.0307385 0.1269296 0.3311352 -0.1750213 0.1250441 0.2043018 -0.2393176 0.0968272 -0.1427133 0.4679543 0.1731368 0.1432017 0.1062597 0.0485997 -0.3933812 0.3052152 -0.0233089 -0.1179632 -0.0660654 -0.0424701 -0.225892 0.2514385 -0.1842594 -0.0479093 0.095145 -0.0752669 0.0580231 0.0479095 0.0029025 -0.0925186 0.0284044 0.0753714 0.0691804 -0.0626908 -0.0772883 -0.0330072 0.0272845 -0.0760173 -0.0631497 -0.0966525 0.047549 0.0733894 0.0907306 -0.0180098 0.0890623 -0.0527515 -0.0406556 -0.0187453 -0.0400174 0.1293657 -0.4440806 0.1029216 -0.0672018 -0.0079307 -0.533297 -0.126543 -0.1195841 -0.0496474 -0.3853554 2.0548817 0.4512858 0.347717 0.2809182 1.1533124 -0.1444404 0.2654136 -0.0279533 2.036811 -1.1867561 -0.392159 -0.0093483 -0.2663969 -0.4826731 0.0301262 0.0599778 0.0640261 -0.5149997 -0.5379629 -0.0508949 -0.1864401 -0.0194126 -0.3840726 0.1902801 -0.1803998 0.0485835 -1.2617413 unknown
polarizability: 175.0636932|-42.1850416|220.9758782|35.0127509|30.8745299|134.524598 unknown
InChI: InChI=1/C12H8BF2N/c14-13(15)10-5-1-3-8-7-9-4-2-6-16-12(9)11(8)10/h1-6H,7H2
charge 0 multiplicity 1
24 atoms
C  0.67357558 0.72198936 -0.45589523
C  1.81761179 0.73479041 0.34307124
C  2.19310805 1.82291029 1.12466308
C  1.35517574 2.940166 1.07987049
C  0.20685597 2.9442859 0.28632062
C  -0.14559747 1.83954428 -0.48778555
H  1.58903573 3.82321327 1.66535545
H  -0.42282999 3.82686804 0.2734025
H  -1.04224223 1.86269804 -1.09789374
C  0.55619186 -0.60747235 -1.17429783
H  0.56373038 -0.48235102 -2.26151022
H  -0.37068515 -1.12799525 -0.91406777
C  2.49612042 -0.54808977 0.19945274
C  1.77489818 -1.35463851 -0.68692147
C  4.08180176 -2.10780074 0.55374845
C  2.26612102 -2.61910257 -0.95126636
C  3.44802045 -2.99572027 -0.31125542
H  5.0009634 -2.39452576 1.05474494
H  1.76087455 -3.30014277 -1.62781906
H  3.87986253 -3.97456911 -0.47998029
N  3.61976656 -0.88210085 0.81963905
B  3.49675162 1.73925746 1.9872817
F  4.66787683 2.17393783 1.53240872
F  3.47251463 1.35105043 3.25857079
