program: Gaussian 16
title: f_nmeimidazole
version: ES64L-G16RevC.02
method: RwB97XD
basis: GenECP
operation: Freq
keyword: #N
keyword: Geom=AllCheck
keyword: Guess=TCheck
keyword: SCRF=Check
keyword: GenChk
keyword: RwB97XD/GenECP
keyword: Freq
converged: YES YES NO YES
title: Mulliken charges:
elementType: C H C N N B C H H H C H F F
charge: -0.166179 0.228890 -0.543014 0.018075 -0.177350 0.375098 -0.400215 0.161862 0.209630 0.203315 -0.063204 0.236483 -0.036141 -0.047250
chargesum: -0.00000
title: Mulliken charges with hydrogens summed into heavy atoms:
elementType: C C N N B C C F F
charge: 0.062711 -0.543014 0.018075 -0.177350 0.375098 0.174592 0.173279 -0.036141 -0.047250
1716.lowfreq: -8.8665 -0.0006 -0.0004 0.0009 7.5027 14.4604 57.4342 80.1595 124.1695
frequency: 57.2979 79.9092 124.1377 132.2963 253.1986 317.7884 352.4939 461.3871 602.6670 611.1184 652.5748 713.9100 734.2605 835.0341 874.6165 969.7997 1075.1222 1091.1121 1120.2156 1153.4546 1221.3307 1271.3643 1312.6024 1367.0108 1396.9999 1461.8375 1475.6943 1491.3706 1513.0779 1554.0588 1604.3775 3069.8603 3150.4879 3169.9703 3254.6777 3277.2265
redmass: 1.4096 2.9430 7.1931 4.2246 4.2261 4.9258 6.5694 5.5920 11.5351 5.0724 3.5538 4.7903 4.3103 1.5477 1.4349 8.5924 3.3979 1.5525 2.4006 1.3193 2.1913 1.6280 9.8926 8.0997 4.0929 1.5937 3.3443 1.0369 1.2002 3.8045 4.6202 1.0332 1.1066 1.1048 1.0982 1.1004
irintensity: 0.3603 2.2985 1.3418 0.1958 0.3240 1.9507 7.6164 2.9530 16.5975 8.3036 72.6554 9.8025 30.0560 1.0790 26.3628 72.4743 19.7281 5.0050 59.7055 0.3693 239.0929 138.7404 423.7010 128.7805 30.7964 8.1374 76.7335 14.3568 53.8303 4.3254 301.6159 39.0915 11.0128 7.3721 1.0900 0.6635
temp: 298.150 k
press: 1.00000 atm
elementType: 6 1 6 7 7 5 6 1 1 1 6 1 9 9
symmnumber: 1
zpe: 262008.1 jmol-1
zpe.correction: 0.099794 hartree
zpe.thermalcorrener: 0.108078 hartree
zpe.thermalcorrenthalpy: 0.109022 hartree
zpe.thermalcorrgfe: 0.065524 hartree
zpe.sumelectzpe: -489.494576 hartree
zpe.sumelectthermal: -489.486291 hartree
zpe.sumelectthermalent: -489.485347 hartree
zpe.sumelectthermalfe: -489.528845 hartree
dipole: -3.6635 6.2877 -0.5478
dipole: 7.2977
quadrupole: -70.0325 -37.8677 -52.1653
quadrupole: 13.0622 -2.4431 0.2298
quadrupole: -16.6774 15.4875 1.1899 13.0622 -2.4431 0.2298
hfenergy: -489.5943694 hartree
pointgroup: C01 [X(C4H5B1F2N2)]
dipole: -1.4413171 2.4737683 -0.2155066 debye
dipolederiv: 0.1553934 -0.3400494 0.1369063 -0.296378 0.3551579 -0.1743929 0.2182853 -0.3236446 0.0392862 0.1706546 0.0409729 -0.0047964 0.0323988 0.0928868 -0.0715643 -0.0195105 -0.0441235 0.0621906 -0.5024251 0.3731275 -0.1446102 0.3338481 -0.6763638 0.2913219 -0.2109583 0.4149366 -0.197309 -0.3893391 0.3938254 -0.0408448 0.3117558 -0.7216439 -0.0106262 -0.2104773 0.2932627 -0.3056336 -0.3641663 0.056063 0.0388534 0.1015363 -0.560821 -0.0595717 0.1087808 -0.1910251 -0.3253692 1.3708111 -0.8249441 0.4455019 -0.7683267 2.1036576 -0.0918964 0.5427672 -0.2657659 1.9735062 0.3774315 -0.2061108 -0.0185636 -0.2104384 0.6121265 -0.0282316 -0.0006595 -0.0568825 0.1681724 0.0768261 0.0463346 -0.019966 0.0219777 0.0502542 -0.0450824 -0.0713766 0.0474278 -0.0660477 -0.0448397 0.0823825 0.0669684 0.012205 -0.0113385 0.0472154 0.1110776 -0.0154403 0.0275243 -0.0153171 -0.0760444 -0.0389454 0.021396 -0.0909678 -0.0126966 -0.0280662 -0.0492164 0.089999 0.0811869 -0.1550514 -0.0746272 -0.1362666 0.4141521 0.2495126 -0.0349405 0.1825673 0.2220044 0.1229109 0.0514642 -0.0623753 0.0548141 0.0914993 0.035061 -0.0600329 0.0257776 0.0317456 -0.5640775 0.4359711 -0.0159256 0.4580448 -1.188394 -0.0687088 0.0219201 -0.1368845 -0.4822585 -0.4750496 0.1220587 -0.2675756 0.0634331 -0.4702054 -0.06034 -0.3668093 0.1190107 -1.2378104 unknown
polarizability: 66.567773|-21.2989446|88.5186847|10.9452831|-1.5794804|81.8766904 unknown
InChI: InChI=1/C4H5BF2N2/c1-9-2-4(5(6)7)8-3-9/h2-3H,1H3
charge 0 multiplicity 1
14 atoms
C  2.64678711 1.59100789 1.08978882
H  2.66165865 2.12072018 2.02932925
C  3.19177981 0.3815664 0.71480239
N  2.01537466 2.08713179 -0.00690731
N  2.88954603 0.14096795 -0.61700637
B  4.00463462 -0.56890491 1.59294096
C  1.28357734 3.33898442 -0.09701147
H  0.94222247 3.47233905 -1.1225556
H  0.41746702 3.32042061 0.56561837
H  1.93194576 4.17366946 0.17102245
C  2.19334719 1.17180026 -1.00619927
H  1.78428807 1.32760582 -1.99433034
F  4.49769109 -1.72158186 1.15459234
F  4.25927815 -0.27155931 2.87193097
