program: Gaussian 16
title: f_quinoline
version: ES64L-G16RevC.02
method: RwB97XD
basis: GenECP
operation: Freq
keyword: #N
keyword: Geom=AllCheck
keyword: Guess=TCheck
keyword: SCRF=Check
keyword: GenChk
keyword: RwB97XD/GenECP
keyword: Freq
converged: YES YES YES YES
title: Mulliken charges:
elementType: C C C C C C H C H H C C H H H N B F F
charge: -0.125597 -0.930047 -2.254453 2.233877 -0.004784 -0.251439 0.239458 -0.222405 0.206476 0.241783 -0.392080 0.103304 0.227711 0.251390 0.255968 0.090881 0.373637 -0.022102 -0.021577
chargesum: -0.00000
title: Mulliken charges with hydrogens summed into heavy atoms:
elementType: C C C C C C C C C N B F F
charge: 0.113860 -0.930047 -2.254453 2.233877 0.201692 -0.009656 0.005305 -0.140689 0.359272 0.090881 0.373637 -0.022102 -0.021577
chargesum: 0.00000
1716.lowfreq: -9.6765 0.0002 0.0002 0.0004 4.0443 7.4199 22.6969 90.7086 148.8225
frequency: 21.4781 90.6889 148.8202 179.5802 208.4002 301.4779 328.4458 408.9282 451.9145 483.7457 514.2454 536.0846 562.1867 584.0688 637.9322 688.2118 705.1994 789.1257 832.8062 833.2936 857.8245 874.8424 977.9562 994.0997 999.6034 1019.7592 1030.7993 1059.4963 1099.0968 1159.4636 1168.9758 1231.5682 1238.1715 1281.9869 1296.1296 1343.4102 1369.7431 1406.7530 1436.9723 1466.2334 1519.8857 1557.4435 1645.4710 1666.5167 1691.3999 3165.2301 3187.2533 3190.9442 3201.6128 3217.4948 3220.7509
redmass: 14.1712 6.2218 9.4180 4.2858 4.2489 10.3563 10.9088 4.3042 5.0967 3.2160 3.7401 9.0258 7.0577 10.0681 3.7112 7.8916 4.5937 1.2826 5.4977 1.5933 6.6883 3.9502 1.3569 1.4183 6.8338 1.3637 1.3744 2.7791 2.1670 1.5378 1.5194 1.7217 2.2665 1.6967 4.7164 3.6329 3.3776 4.7159 2.5508 2.0872 2.9198 4.2592 6.9294 5.5448 6.8129 1.0906 1.0888 1.0904 1.0911 1.0974 1.0976
irintensity: 0.0661 0.9024 0.3187 5.0898 0.0012 4.4540 2.0845 2.8913 3.0426 0.1485 22.1533 15.5446 5.5055 31.9549 11.1524 2.2142 27.1614 0.4239 2.3420 122.4977 6.5040 3.8238 0.1003 0.0734 48.5712 0.1700 1.2133 0.7712 24.7643 13.5064 66.2728 119.6765 25.3412 15.3704 313.6413 248.6408 276.8482 7.4591 34.6310 4.0127 18.4495 65.4725 136.8329 13.8168 58.4806 27.8173 2.8040 7.6670 5.4730 16.7042 13.0799
temp: 298.150 k
press: 1.00000 atm
elementType: 6 6 6 6 6 6 1 6 1 1 6 6 1 1 1 7 5 9 9
symmnumber: 1
zpe: 358183.0 jmol-1
zpe.correction: 0.136425 hartree
zpe.thermalcorrener: 0.146150 hartree
zpe.thermalcorrenthalpy: 0.147095 hartree
zpe.thermalcorrgfe: 0.099669 hartree
zpe.sumelectzpe: -625.820392 hartree
zpe.sumelectthermal: -625.810667 hartree
zpe.sumelectthermalent: -625.809722 hartree
zpe.sumelectthermalfe: -625.857148 hartree
dipole: -2.4482 4.7141 0.2574
dipole: 5.3182
quadrupole: -55.3318 -59.2177 -74.6126
quadrupole: -8.2432 -1.9990 -0.6100
quadrupole: 7.7222 3.8363 -11.5586 -8.2432 -1.9990 -0.6100
hfenergy: -625.956817 hartree
pointgroup: C01 [X(C9H6B1F2N1)]
dipole: -0.9632003 1.8546841 0.1012693 debye
dipolederiv: 0.0032935 -0.3712354 -0.0089242 0.0469788 0.3211097 -0.0079258 -0.0076339 0.0368562 -0.1084178 -0.4419683 0.4961589 0.0174769 0.2402494 -0.7711924 -0.0201703 0.0214027 -0.0570886 -0.2440561 0.2666576 0.1899354 -0.0262723 0.1661701 0.3134614 -0.0283396 -0.0289898 -0.0222555 0.120585 -0.2714452 0.0614964 0.0441639 -0.0684938 -0.3128114 0.0132335 0.0440285 -0.002077 0.053606 0.2673354 0.1598779 -0.0531402 0.022711 0.2231194 -0.0051988 -0.0513611 -0.0242037 -0.1196224 0.0992844 -0.0558362 -0.0314343 -0.1731151 -0.4930727 0.0260732 -0.0328925 0.0119487 -0.145851 0.0618412 -0.0689452 0.0099805 -0.0771352 -0.0140454 0.0118479 0.010915 0.0126606 0.134767 0.3851679 0.0158107 -0.067949 0.1376791 0.2910829 -0.0222132 -0.0669493 -0.0045343 -0.1065976 0.0371473 0.0427844 0.0144806 0.1029097 -0.0436937 -0.0124052 0.014028 -0.006263 0.1448638 -0.0954213 -0.0046509 0.0333553 -0.0086371 0.0818934 0.0019893 0.0342181 0.0019049 0.1588695 -0.530737 0.047244 0.0532263 0.2879415 0.0093131 -0.0397688 0.0524811 -0.0082692 -0.1419467 0.5007895 -0.0425524 -0.0665801 -0.374434 0.3861275 0.0466977 -0.0646676 0.001924 0.0255711 0.0388721 0.1024429 0.0127937 0.0472742 -0.0258471 -0.0048045 0.0116928 -0.0108668 0.1409711 0.0439548 -0.0813127 0.0167121 -0.0866769 -0.0384989 0.0133377 0.0171765 0.0129106 0.1602733 -0.1330341 -0.0441659 0.0342224 -0.0087103 0.0717435 0.0012703 0.0335144 0.0063967 0.1094598 -0.4744315 -0.119218 0.0248333 -0.0297757 -0.6050379 0.0070311 0.0298514 0.0160597 -0.3146346 1.9022697 -0.4506603 -0.0498842 -0.3097706 2.7057077 0.041404 -0.0577669 0.0550105 0.7501242 -1.1150141 0.4004403 0.0379088 0.2741444 -0.7021287 -0.0168091 0.0371274 -0.0241471 -0.30294 -0.5445617 -0.2776138 0.0050304 -0.1893095 -1.3972305 -0.0052494 0.0038253 0.0040333 -0.3150246 unknown
polarizability: 177.3932217|18.6112406|170.4487045|-13.9744598|-3.3781341|72.6939063 unknown
InChI: InChI=1/C9H6BF2N/c11-10(12)8-5-1-3-7-4-2-6-13-9(7)8/h1-6H
charge 0 multiplicity 1
19 atoms
C  -3.98868846 0.04520718 0.202982
C  -2.61824428 0.0673672 0.0283386
C  -1.96258241 1.33680873 -0.0717837
C  -2.73474694 2.52567596 0.01986788
C  -4.13669939 2.44235839 0.2048871
C  -4.75386965 1.22564649 0.29342401
H  -4.49691836 -0.9097409 0.27625798
C  -2.0630156 3.76689455 -0.08136075
H  -4.71060845 3.36103536 0.27303799
H  -5.8263736 1.16164231 0.43303845
C  -0.70997574 3.78100699 -0.26501102
C  -0.03251598 2.54409421 -0.34867372
H  -2.63227302 4.68825593 -0.01243619
H  -0.15612844 4.707863 -0.34795882
H  1.04438622 2.53342057 -0.49822122
N  -0.61583449 1.37465092 -0.2584921
B  -1.88658317 -1.29968327 -0.03482045
F  -0.57882774 -1.4881926 -0.09663158
F  -2.61406811 -2.42440506 -0.01071883
