program: Gaussian 16
title: h_benzopiperidine
version: ES64L-G16RevC.02
method: RwB97XD
basis: GenECP
operation: Freq
keyword: #N
keyword: Geom=AllCheck
keyword: Guess=TCheck
keyword: SCRF=Check
keyword: GenChk
keyword: RwB97XD/GenECP
keyword: Freq
converged: YES YES YES YES
title: Mulliken charges:
elementType: C C C C C C H H H H B C C C C C H H H H H H N H H H H H H
charge: -0.548372 -0.042356 0.763647 -1.312391 0.332094 -0.314305 0.207254 0.251636 0.191209 0.240874 -0.158475 -0.172444 -0.534621 -0.456185 -0.235672 -0.377071 0.194769 0.173864 0.189010 0.145014 0.205941 0.149397 0.493989 0.106875 0.192589 0.169780 0.169013 -0.021500 -0.003565
chargesum: -0.00000
title: Mulliken charges with hydrogens summed into heavy atoms:
elementType: C C C C C C B C C C C C N
charge: -0.341118 0.209280 0.763647 -1.312391 0.523303 -0.073430 -0.183540 0.166349 -0.235157 -0.087551 0.098353 -0.021733 0.493989
1716.lowfreq: -7.8274 -0.0004 0.0003 0.0005 3.7100 14.0045 65.6028 84.9169 113.0837
frequency: 65.5950 84.8729 113.0811 179.8821 225.4179 262.7724 287.3910 290.9708 325.7290 366.6070 407.4819 453.5427 463.7691 475.6469 502.8977 556.7579 567.4330 627.8064 731.8939 759.4053 787.2774 826.8671 831.3715 854.9298 870.6903 875.0919 891.5337 938.3023 958.3478 984.6246 989.4769 1017.0278 1021.0949 1050.2156 1070.8298 1084.4921 1092.9608 1132.6487 1157.6733 1166.7009 1184.6639 1188.8821 1197.7970 1254.3353 1263.2395 1291.9023 1297.9477 1312.3814 1315.4303 1336.6948 1360.0644 1389.3805 1394.5925 1395.1242 1402.5958 1427.4563 1479.8999 1486.5143 1487.7679 1493.6285 1498.6333 1505.7461 1524.2753 1622.7123 1660.9940 2555.8722 2633.7309 2939.9108 2941.7409 3029.8829 3046.5114 3048.0797 3090.8088 3097.0940 3101.6548 3110.8581 3139.9447 3181.0599 3187.5428 3211.2537 3222.6607
redmass: 3.4885 3.1330 3.5036 3.1304 2.3435 1.8722 3.6750 2.0195 3.0732 1.4336 1.8853 3.1467 2.8499 2.9197 2.3832 2.9082 3.4165 3.4530 3.1683 2.2348 1.6823 4.1443 1.4887 1.9307 1.6482 1.5941 1.4595 2.2552 3.1331 1.3321 1.3574 1.4095 1.3531 2.6921 1.9289 2.2401 1.4724 1.9736 2.0815 2.0731 1.3108 1.3345 1.1939 1.7299 1.6774 1.9586 1.2627 1.4098 1.4617 3.7182 1.3089 1.5940 1.5190 1.5981 1.4794 1.6707 1.0992 1.1453 2.0409 1.2299 1.0884 1.3164 1.7338 5.5086 5.6842 1.0574 1.1238 1.0729 1.0727 1.0668 1.0620 1.0615 1.0952 1.1034 1.1047 1.0906 1.0889 1.0869 1.0905 1.0958 1.0939
irintensity: 1.9603 1.4445 0.2538 1.9990 3.1242 2.1424 0.0250 3.5261 0.1859 2.2769 5.7462 2.5858 1.0985 7.5329 3.1680 14.0325 6.2626 3.6834 3.0990 31.9621 53.7105 9.9424 0.6710 12.1715 4.7252 14.6615 7.8137 1.5064 35.3500 4.5642 7.0155 28.0408 6.7822 21.4891 10.5864 13.0172 3.2673 14.5754 38.7752 7.7459 13.2656 3.0566 21.5095 58.3322 114.2809 68.7232 9.0539 16.7604 64.0504 41.5189 4.6675 4.8032 21.1482 9.2140 2.5884 71.5416 5.4202 38.2397 162.8725 33.2075 6.7439 62.6587 97.7374 58.5889 215.8698 249.3992 167.6069 28.6614 164.7686 42.1038 34.5732 30.8041 72.2692 38.4441 68.3347 28.1362 19.8744 5.4702 14.5988 28.6170 10.3005
temp: 298.150 k
press: 1.00000 atm
elementType: 6 6 6 6 6 6 1 1 1 1 5 6 6 6 6 6 1 1 1 1 1 1 7 1 1 1 1 1 1
symmnumber: 1
zpe: 661908.0 jmol-1
zpe.correction: 0.252107 hartree
zpe.thermalcorrener: 0.263469 hartree
zpe.thermalcorrenthalpy: 0.264413 hartree
zpe.thermalcorrgfe: 0.215243 hartree
zpe.sumelectzpe: -508.105815 hartree
zpe.sumelectthermal: -508.094453 hartree
zpe.sumelectthermalent: -508.093509 hartree
zpe.sumelectthermalfe: -508.142679 hartree
dipole: -1.3694 1.9280 -0.4352
dipole: 2.4046
quadrupole: -81.4610 -61.8456 -80.5018
quadrupole: 1.0245 1.1356 -4.7291
quadrupole: -6.8582 12.7572 -5.8990 1.0245 1.1356 -4.7291
hfenergy: -508.3579222 hartree
pointgroup: C01 [X(C11H16B1N1)]
dipole: -0.5387806 0.7585493 -0.1712153 debye
polarizability: 194.4185879|16.951203|197.9771023|3.6987142|-32.5562973|133.1316494 unknown
InChI: InChI=1/C11H16BN/c12-10-6-2-3-7-11(10)13-8-4-1-5-9-13/h2-3,6-7H,1,4-5,8-9,12H2
charge 0 multiplicity 1
29 atoms
C  -0.59966976 0.92998089 0.67885222
C  0.77169916 1.07826961 0.8122648
C  1.46077182 2.20478142 0.32693136
C  0.69896015 3.25652621 -0.25957004
C  -0.68638232 3.094083 -0.40077613
C  -1.3179158 1.94476129 0.05561513
H  -1.10162788 0.04302388 1.0467786
H  1.35103833 0.28623939 1.27677243
H  -1.28719913 3.87889424 -0.84176528
H  -2.39340875 1.85519429 -0.05844284
B  2.99134677 2.11928486 0.2675503
C  0.63577821 5.29426796 -1.62228739
C  2.10209374 5.18000986 0.30029097
C  1.62632386 6.19717811 -2.35489955
C  3.14502731 6.06457111 -0.36751503
C  2.48106131 6.99998248 -1.37661172
H  1.07262471 6.86377288 -3.02253334
H  2.27241901 5.57005288 -2.97871828
H  3.67722056 6.63578723 0.39869357
H  3.87617274 5.42511884 -0.87376372
H  3.23214438 7.58453017 -1.91482239
H  1.84402512 7.71487109 -0.84010056
N  1.33899284 4.41965072 -0.69382455
H  2.57273298 4.49168521 0.99939451
H  1.40773053 5.81130983 0.88435209
H  -0.11020061 5.9174925 -1.09612124
H  0.10147153 4.67906203 -2.3482966
H  3.6417967 2.8580116 -0.41047184
H  3.54708763 1.24871583 0.8754929
